{"text_format":"1","workbook":"xlsx","n_sheets":2,"sheets":["Report","Raw"],"not_rendered":{"charts":0,"images":0,"macros":1,"external_links":0,"defined_names":4,"comments":1,"pivot_tables":0},"unopened":[],"bounds":{"document_bytes":16777216,"sheet_cells":100000,"rows_first":2000,"rows_last":500,"rows_between":2000,"halvings":0,"cell_chars":16384,"cell_head_chars":4096},"cells_cut":0,"cells_raw":0,"read":"whole","date_system":"1900"}

{"sheet":"Report","index":0,"n_rows":38,"n_cols":12,"rows_kept":38,"cut":false,"hidden":false,"merged":[]}
[1,null,"公司代號","公司中文簡稱","公司英文簡稱","事件日","事件類別","事件註記","時間","開會內容","開會地點"]
[null,null,{"$f":"IF(Raw!R2=\"\",\"\",LEFT(Raw!R2,FIND(\" \",Raw!R2)-1))","v":"1720"},{"$f":"IF(Raw!U2=\"\",\"\",Raw!U2)","v":"生達"},{"$f":"IF(Raw!V2=\"\",\"\",Raw!V2)","v":"S.C.P.C"},{"$f":"IF(Raw!S2=\"\",\"\",Raw!S2)","v":"2024-04-25"},{"$f":"IF(Raw!T2=\"\",\"\",Raw!T2)","v":"法說會"},{"$f":"IF(Raw!W2=\"\",\"\",IF(Raw!W2=\"Y\",\"主動舉辦\",\"受邀參加\"))","v":"受邀參加"},{"$f":"IF(Raw!X2=\"\",\"\",Raw!X2)","v":"14:00"},{"$f":"IF(Raw!Z2=\"\",\"\",Raw!Z2)","v":"112年度營運概況說明"},{"$f":"IF(Raw!Y2=\"\",\"\",Raw!Y2)","v":"台北市敦化南路二段97號11樓（敦南摩天大廈-元富證券11樓教育訓練室）"},1]
[null,null,{"$f":"IF(Raw!R3=\"\",\"\",LEFT(Raw!R3,FIND(\" \",Raw!R3)-1))","v":"2762"},{"$f":"IF(Raw!U3=\"\",\"\",Raw!U3)","v":"世界健身-KY"},{"$f":"IF(Raw!V3=\"\",\"\",Raw!V3)","v":"World Gym"},{"$f":"IF(Raw!S3=\"\",\"\",Raw!S3)","v":"2024-04-25"},{"$f":"IF(Raw!T3=\"\",\"\",Raw!T3)","v":"法說會"},{"$f":"IF(Raw!W3=\"\",\"\",IF(Raw!W3=\"Y\",\"主動舉辦\",\"受邀參加\"))","v":"受邀參加"},{"$f":"IF(Raw!X3=\"\",\"\",Raw!X3)","v":"14:00"},{"$f":"IF(Raw!Z3=\"\",\"\",Raw!Z3)","v":"受邀請參加元大證券舉辦之法人說明會"},{"$f":"IF(Raw!Y3=\"\",\"\",Raw!Y3)","v":"台北市南京東路三段219號11樓"},{"$f":"IF(C3=\"\",\"\",IF(F3=F2,L2,MOD(L2+1,2)))","v":1}]
[null,null,{"$f":"IF(Raw!R4=\"\",\"\",LEFT(Raw!R4,FIND(\" \",Raw!R4)-1))","v":"5013"},{"$f":"IF(Raw!U4=\"\",\"\",Raw!U4)","v":"強新"},{"$f":"IF(Raw!V4=\"\",\"\",Raw!V4)","v":"New Best"},{"$f":"IF(Raw!S4=\"\",\"\",Raw!S4)","v":"2024-04-25"},{"$f":"IF(Raw!T4=\"\",\"\",Raw!T4)","v":"法說會"},{"$f":"IF(Raw!W4=\"\",\"\",IF(Raw!W4=\"Y\",\"主動舉辦\",\"受邀參加\"))","v":"受邀參加"},{"$f":"IF(Raw!X4=\"\",\"\",Raw!X4)","v":"14:00"},{"$f":"IF(Raw!Z4=\"\",\"\",Raw!Z4)","v":"參加元大證券舉辦之線上法說會"},{"$f":"IF(Raw!Y4=\"\",\"\",Raw!Y4)","v":"線上法說會"},{"$f":"IF(C4=\"\",\"\",IF(F4=F3,L3,MOD(L3+1,2)))","v":1}]
[null,null,{"$f":"IF(Raw!R5=\"\",\"\",LEFT(Raw!R5,FIND(\" \",Raw!R5)-1))","v":"3147"},{"$f":"IF(Raw!U5=\"\",\"\",Raw!U5)","v":"大綜"},{"$f":"IF(Raw!V5=\"\",\"\",Raw!V5)","v":"Jetwell"},{"$f":"IF(Raw!S5=\"\",\"\",Raw!S5)","v":"2024-04-25"},{"$f":"IF(Raw!T5=\"\",\"\",Raw!T5)","v":"法說會"},{"$f":"IF(Raw!W5=\"\",\"\",IF(Raw!W5=\"Y\",\"主動舉辦\",\"受邀參加\"))","v":"受邀參加"},{"$f":"IF(Raw!X5=\"\",\"\",Raw!X5)","v":"14:30"},{"$f":"IF(Raw!Z5=\"\",\"\",Raw!Z5)","v":"說明公司營運狀況"},{"$f":"IF(Raw!Y5=\"\",\"\",Raw!Y5)","v":"奔亞會議中心206廳(台北市復興北路99號2樓)"},1]
[null,null,{"$f":"IF(Raw!R6=\"\",\"\",LEFT(Raw!R6,FIND(\" \",Raw!R6)-1))","v":"5203"},{"$f":"IF(Raw!U6=\"\",\"\",Raw!U6)","v":"訊連"},{"$f":"IF(Raw!V6=\"\",\"\",Raw!V6)","v":"Cyberlink"},{"$f":"IF(Raw!S6=\"\",\"\",Raw!S6)","v":"2024-04-25"},{"$f":"IF(Raw!T6=\"\",\"\",Raw!T6)","v":"法說會"},{"$f":"IF(Raw!W6=\"\",\"\",IF(Raw!W6=\"Y\",\"主動舉辦\",\"受邀參加\"))","v":"受邀參加"},{"$f":"IF(Raw!X6=\"\",\"\",Raw!X6)","v":"14:30"},{"$f":"IF(Raw!Z6=\"\",\"\",Raw!Z6)","v":"會中報告113年第一季度經營成果"},{"$f":"IF(Raw!Y6=\"\",\"\",Raw!Y6)","v":"線上法說會"},1]
[null,null,{"$f":"IF(Raw!R7=\"\",\"\",LEFT(Raw!R7,FIND(\" \",Raw!R7)-1))","v":"3105"},{"$f":"IF(Raw!U7=\"\",\"\",Raw!U7)","v":"穩懋"},{"$f":"IF(Raw!V7=\"\",\"\",Raw!V7)","v":"Win"},{"$f":"IF(Raw!S7=\"\",\"\",Raw!S7)","v":"2024-04-26"},{"$f":"IF(Raw!T7=\"\",\"\",Raw!T7)","v":"法說會"},{"$f":"IF(Raw!W7=\"\",\"\",IF(Raw!W7=\"Y\",\"主動舉辦\",\"受邀參加\"))","v":"受邀參加"},{"$f":"IF(Raw!X7=\"\",\"\",Raw!X7)","v":"14:00"},{"$f":"IF(Raw!Z7=\"\",\"\",Raw!Z7)","v":"舉辦2024年第一季線上法人說明會，說明本公司營運狀況。"},{"$f":"IF(Raw!Y7=\"\",\"\",Raw!Y7)","v":"線上法說會"},0]
[null,null,{"$f":"IF(Raw!R8=\"\",\"\",LEFT(Raw!R8,FIND(\" \",Raw!R8)-1))","v":"2439"},{"$f":"IF(Raw!U8=\"\",\"\",Raw!U8)","v":"美律"},{"$f":"IF(Raw!V8=\"\",\"\",Raw!V8)","v":"Merry"},{"$f":"IF(Raw!S8=\"\",\"\",Raw!S8)","v":"2024-04-26"},{"$f":"IF(Raw!T8=\"\",\"\",Raw!T8)","v":"法說會"},{"$f":"IF(Raw!W8=\"\",\"\",IF(Raw!W8=\"Y\",\"主動舉辦\",\"受邀參加\"))","v":"受邀參加"},{"$f":"IF(Raw!X8=\"\",\"\",Raw!X8)","v":"15:00"},{"$f":"IF(Raw!Z8=\"\",\"\",Raw!Z8)","v":"公布公司 2024年第1季營運成果"},{"$f":"IF(Raw!Y8=\"\",\"\",Raw!Y8)","v":"線上法說會"},0]
[null,null,{"$f":"IF(Raw!R9=\"\",\"\",LEFT(Raw!R9,FIND(\" \",Raw!R9)-1))","v":"2454"},{"$f":"IF(Raw!U9=\"\",\"\",Raw!U9)","v":"聯發科"},{"$f":"IF(Raw!V9=\"\",\"\",Raw!V9)","v":"MTK"},{"$f":"IF(Raw!S9=\"\",\"\",Raw!S9)","v":"2024-04-26"},{"$f":"IF(Raw!T9=\"\",\"\",Raw!T9)","v":"法說會"},{"$f":"IF(Raw!W9=\"\",\"\",IF(Raw!W9=\"Y\",\"主動舉辦\",\"受邀參加\"))","v":"主動舉辦"},{"$f":"IF(Raw!X9=\"\",\"\",Raw!X9)","v":"15:00"},{"$f":"IF(Raw!Z9=\"\",\"\",Raw!Z9)","v":"2024年第1季財務報告及2024年第2季業績展望"},{"$f":"IF(Raw!Y9=\"\",\"\",Raw!Y9)","v":"線上法說會"},0]
[null,null,{"$f":"IF(Raw!R10=\"\",\"\",LEFT(Raw!R10,FIND(\" \",Raw!R10)-1))","v":"4968"},{"$f":"IF(Raw!U10=\"\",\"\",Raw!U10)","v":"立積"},{"$f":"IF(Raw!V10=\"\",\"\",Raw!V10)","v":"RichWave"},{"$f":"IF(Raw!S10=\"\",\"\",Raw!S10)","v":"2024-04-26"},{"$f":"IF(Raw!T10=\"\",\"\",Raw!T10)","v":"法說會"},{"$f":"IF(Raw!W10=\"\",\"\",IF(Raw!W10=\"Y\",\"主動舉辦\",\"受邀參加\"))","v":"主動舉辦"},{"$f":"IF(Raw!X10=\"\",\"\",Raw!X10)","v":"15:30"},{"$f":"IF(Raw!Z10=\"\",\"\",Raw!Z10)","v":""},{"$f":"IF(Raw!Y10=\"\",\"\",Raw!Y10)","v":"線上法說會"},0]
[null,null,{"$f":"IF(Raw!R11=\"\",\"\",LEFT(Raw!R11,FIND(\" \",Raw!R11)-1))","v":"4915"},{"$f":"IF(Raw!U11=\"\",\"\",Raw!U11)","v":"致伸"},{"$f":"IF(Raw!V11=\"\",\"\",Raw!V11)","v":"Primax"},{"$f":"IF(Raw!S11=\"\",\"\",Raw!S11)","v":"2024-04-29"},{"$f":"IF(Raw!T11=\"\",\"\",Raw!T11)","v":"法說會"},{"$f":"IF(Raw!W11=\"\",\"\",IF(Raw!W11=\"Y\",\"主動舉辦\",\"受邀參加\"))","v":"受邀參加"},{"$f":"IF(Raw!X11=\"\",\"\",Raw!X11)","v":"14:30"},{"$f":"IF(Raw!Z11=\"\",\"\",Raw!Z11)","v":"說明營運成果及未來展望"},{"$f":"IF(Raw!Y11=\"\",\"\",Raw!Y11)","v":"國票金控大樓 (台北市樂群三路128號7樓)"},1]
[null,null,{"$f":"IF(Raw!R12=\"\",\"\",LEFT(Raw!R12,FIND(\" \",Raw!R12)-1))","v":"6269"},{"$f":"IF(Raw!U12=\"\",\"\",Raw!U12)","v":"台郡"},{"$f":"IF(Raw!V12=\"\",\"\",Raw!V12)","v":"Flexium"},{"$f":"IF(Raw!S12=\"\",\"\",Raw!S12)","v":"2024-04-29"},{"$f":"IF(Raw!T12=\"\",\"\",Raw!T12)","v":"法說會"},{"$f":"IF(Raw!W12=\"\",\"\",IF(Raw!W12=\"Y\",\"主動舉辦\",\"受邀參加\"))","v":"受邀參加"},{"$f":"IF(Raw!X12=\"\",\"\",Raw!X12)","v":"14:30"},{"$f":"IF(Raw!Z12=\"\",\"\",Raw!Z12)","v":"說明公司113年第1季營運成果"},{"$f":"IF(Raw!Y12=\"\",\"\",Raw!Y12)","v":"元大證券寶慶大樓4樓會議室(台北市寶慶路69號)"},1]
[null,null,{"$f":"IF(Raw!R13=\"\",\"\",LEFT(Raw!R13,FIND(\" \",Raw!R13)-1))","v":"6792"},{"$f":"IF(Raw!U13=\"\",\"\",Raw!U13)","v":"詠業"},{"$f":"IF(Raw!V13=\"\",\"\",Raw!V13)","v":"Unictron"},{"$f":"IF(Raw!S13=\"\",\"\",Raw!S13)","v":"2024-04-29"},{"$f":"IF(Raw!T13=\"\",\"\",Raw!T13)","v":"法說會"},{"$f":"IF(Raw!W13=\"\",\"\",IF(Raw!W13=\"Y\",\"主動舉辦\",\"受邀參加\"))","v":"受邀參加"},{"$f":"IF(Raw!X13=\"\",\"\",Raw!X13)","v":"15:00"},{"$f":"IF(Raw!Z13=\"\",\"\",Raw!Z13)","v":"說明113年度第1季營業成果及未來營運展望"},{"$f":"IF(Raw!Y13=\"\",\"\",Raw!Y13)","v":"線上法說會"},1]
[null,null,{"$f":"IF(Raw!R14=\"\",\"\",LEFT(Raw!R14,FIND(\" \",Raw!R14)-1))","v":"2015"},{"$f":"IF(Raw!U14=\"\",\"\",Raw!U14)","v":"豐興"},{"$f":"IF(Raw!V14=\"\",\"\",Raw!V14)","v":"FH"},{"$f":"IF(Raw!S14=\"\",\"\",Raw!S14)","v":"2024-04-30"},{"$f":"IF(Raw!T14=\"\",\"\",Raw!T14)","v":"法說會"},{"$f":"IF(Raw!W14=\"\",\"\",IF(Raw!W14=\"Y\",\"主動舉辦\",\"受邀參加\"))","v":"受邀參加"},{"$f":"IF(Raw!X14=\"\",\"\",Raw!X14)","v":"14:00"},{"$f":"IF(Raw!Z14=\"\",\"\",Raw!Z14)","v":"受邀參加國票綜合證券法人說明會，報名請洽國票綜合證券李小姐02-25288275 Email:ann"},{"$f":"IF(Raw!Y14=\"\",\"\",Raw!Y14)","v":"線上法說會"},0]
[null,null,{"$f":"IF(Raw!R15=\"\",\"\",LEFT(Raw!R15,FIND(\" \",Raw!R15)-1))","v":"2301"},{"$f":"IF(Raw!U15=\"\",\"\",Raw!U15)","v":"光寶科"},{"$f":"IF(Raw!V15=\"\",\"\",Raw!V15)","v":"LTC"},{"$f":"IF(Raw!S15=\"\",\"\",Raw!S15)","v":"2024-04-30"},{"$f":"IF(Raw!T15=\"\",\"\",Raw!T15)","v":"法說會"},{"$f":"IF(Raw!W15=\"\",\"\",IF(Raw!W15=\"Y\",\"主動舉辦\",\"受邀參加\"))","v":"受邀參加"},{"$f":"IF(Raw!X15=\"\",\"\",Raw!X15)","v":"14:00"},{"$f":"IF(Raw!Z15=\"\",\"\",Raw!Z15)","v":"公司113年第1季財務業務情形"},{"$f":"IF(Raw!Y15=\"\",\"\",Raw!Y15)","v":"本公司(臺北市內湖區瑞光路392號1樓國際會議廳)"},0]
[null,null,{"$f":"IF(Raw!R16=\"\",\"\",LEFT(Raw!R16,FIND(\" \",Raw!R16)-1))","v":"2409"},{"$f":"IF(Raw!U16=\"\",\"\",Raw!U16)","v":"友達"},{"$f":"IF(Raw!V16=\"\",\"\",Raw!V16)","v":"AUO"},{"$f":"IF(Raw!S16=\"\",\"\",Raw!S16)","v":"2024-04-30"},{"$f":"IF(Raw!T16=\"\",\"\",Raw!T16)","v":"法說會"},{"$f":"IF(Raw!W16=\"\",\"\",IF(Raw!W16=\"Y\",\"主動舉辦\",\"受邀參加\"))","v":"主動舉辦"},{"$f":"IF(Raw!X16=\"\",\"\",Raw!X16)","v":"14:00"},{"$f":"IF(Raw!Z16=\"\",\"\",Raw!Z16)","v":""},{"$f":"IF(Raw!Y16=\"\",\"\",Raw!Y16)","v":"線上法說會"},0]
[null,null,{"$f":"IF(Raw!R17=\"\",\"\",LEFT(Raw!R17,FIND(\" \",Raw!R17)-1))","v":"5347"},{"$f":"IF(Raw!U17=\"\",\"\",Raw!U17)","v":"世界"},{"$f":"IF(Raw!V17=\"\",\"\",Raw!V17)","v":"VIS"},{"$f":"IF(Raw!S17=\"\",\"\",Raw!S17)","v":"2024-04-30"},{"$f":"IF(Raw!T17=\"\",\"\",Raw!T17)","v":"法說會"},{"$f":"IF(Raw!W17=\"\",\"\",IF(Raw!W17=\"Y\",\"主動舉辦\",\"受邀參加\"))","v":"主動舉辦"},{"$f":"IF(Raw!X17=\"\",\"\",Raw!X17)","v":"14:00"},{"$f":"IF(Raw!Z17=\"\",\"\",Raw!Z17)","v":"2024年第一季的財務結果以及對2024年第二季的營運展望"},{"$f":"IF(Raw!Y17=\"\",\"\",Raw!Y17)","v":"線上法說會"},0]
[null,null,{"$f":"IF(Raw!R18=\"\",\"\",LEFT(Raw!R18,FIND(\" \",Raw!R18)-1))","v":"3479"},{"$f":"IF(Raw!U18=\"\",\"\",Raw!U18)","v":"安勤"},{"$f":"IF(Raw!V18=\"\",\"\",Raw!V18)","v":"Avalue"},{"$f":"IF(Raw!S18=\"\",\"\",Raw!S18)","v":"2024-04-30"},{"$f":"IF(Raw!T18=\"\",\"\",Raw!T18)","v":"法說會"},{"$f":"IF(Raw!W18=\"\",\"\",IF(Raw!W18=\"Y\",\"主動舉辦\",\"受邀參加\"))","v":"受邀參加"},{"$f":"IF(Raw!X18=\"\",\"\",Raw!X18)","v":"14:30"},{"$f":"IF(Raw!Z18=\"\",\"\",Raw!Z18)","v":"公司112年度財務業務狀況"},{"$f":"IF(Raw!Y18=\"\",\"\",Raw!Y18)","v":"凱基證券股份有限公司(台北市明水路700號)"},0]
[null,null,{"$f":"IF(Raw!R19=\"\",\"\",LEFT(Raw!R19,FIND(\" \",Raw!R19)-1))","v":"5258"},{"$f":"IF(Raw!U19=\"\",\"\",Raw!U19)","v":"虹堡"},{"$f":"IF(Raw!V19=\"\",\"\",Raw!V19)","v":"Castles"},{"$f":"IF(Raw!S19=\"\",\"\",Raw!S19)","v":"2024-04-30"},{"$f":"IF(Raw!T19=\"\",\"\",Raw!T19)","v":"法說會"},{"$f":"IF(Raw!W19=\"\",\"\",IF(Raw!W19=\"Y\",\"主動舉辦\",\"受邀參加\"))","v":"受邀參加"},{"$f":"IF(Raw!X19=\"\",\"\",Raw!X19)","v":"14:30"},{"$f":"IF(Raw!Z19=\"\",\"\",Raw!Z19)","v":"說明公司近期營運成果與未來展望"},{"$f":"IF(Raw!Y19=\"\",\"\",Raw!Y19)","v":"台北市中山區建國北路一段96號B1會議室"},0]
[null,null,{"$f":"IF(Raw!R20=\"\",\"\",LEFT(Raw!R20,FIND(\" \",Raw!R20)-1))","v":"6202"},{"$f":"IF(Raw!U20=\"\",\"\",Raw!U20)","v":"盛群"},{"$f":"IF(Raw!V20=\"\",\"\",Raw!V20)","v":"Holtek"},{"$f":"IF(Raw!S20=\"\",\"\",Raw!S20)","v":"2024-04-30"},{"$f":"IF(Raw!T20=\"\",\"\",Raw!T20)","v":"法說會"},{"$f":"IF(Raw!W20=\"\",\"\",IF(Raw!W20=\"Y\",\"主動舉辦\",\"受邀參加\"))","v":"受邀參加"},{"$f":"IF(Raw!X20=\"\",\"\",Raw!X20)","v":"14:30"},{"$f":"IF(Raw!Z20=\"\",\"\",Raw!Z20)","v":"公司113年第1季財務與業務營運相關資訊報告"},{"$f":"IF(Raw!Y20=\"\",\"\",Raw!Y20)","v":"宏遠證券總公司(台北市大安區信義路四段236號7樓)"},0]
[null,null,{"$f":"IF(Raw!R21=\"\",\"\",LEFT(Raw!R21,FIND(\" \",Raw!R21)-1))","v":"6239"},{"$f":"IF(Raw!U21=\"\",\"\",Raw!U21)","v":"力成"},{"$f":"IF(Raw!V21=\"\",\"\",Raw!V21)","v":"PTI"},{"$f":"IF(Raw!S21=\"\",\"\",Raw!S21)","v":"2024-04-30"},{"$f":"IF(Raw!T21=\"\",\"\",Raw!T21)","v":"法說會"},{"$f":"IF(Raw!W21=\"\",\"\",IF(Raw!W21=\"Y\",\"主動舉辦\",\"受邀參加\"))","v":"受邀參加"},{"$f":"IF(Raw!X21=\"\",\"\",Raw!X21)","v":"14:30"},{"$f":"IF(Raw!Z21=\"\",\"\",Raw!Z21)","v":"報告113年第一季營運成果及未來之營運展望"},{"$f":"IF(Raw!Y21=\"\",\"\",Raw!Y21)","v":"新竹縣湖口鄉新竹工業區大同路15號6樓(訓練教室)"},0]
[null,null,{"$f":"IF(Raw!R22=\"\",\"\",LEFT(Raw!R22,FIND(\" \",Raw!R22)-1))","v":"6510"},{"$f":"IF(Raw!U22=\"\",\"\",Raw!U22)","v":"精測"},{"$f":"IF(Raw!V22=\"\",\"\",Raw!V22)","v":"CHPT"},{"$f":"IF(Raw!S22=\"\",\"\",Raw!S22)","v":"2024-04-30"},{"$f":"IF(Raw!T22=\"\",\"\",Raw!T22)","v":"法說會"},{"$f":"IF(Raw!W22=\"\",\"\",IF(Raw!W22=\"Y\",\"主動舉辦\",\"受邀參加\"))","v":"主動舉辦"},{"$f":"IF(Raw!X22=\"\",\"\",Raw!X22)","v":"14:30"},{"$f":"IF(Raw!Z22=\"\",\"\",Raw!Z22)","v":"報告公司營運成果"},{"$f":"IF(Raw!Y22=\"\",\"\",Raw!Y22)","v":"線上法說會"},0]
[null,null,{"$f":"IF(Raw!R23=\"\",\"\",LEFT(Raw!R23,FIND(\" \",Raw!R23)-1))","v":"5371"},{"$f":"IF(Raw!U23=\"\",\"\",Raw!U23)","v":"中光電"},{"$f":"IF(Raw!V23=\"\",\"\",Raw!V23)","v":"Coretronic"},{"$f":"IF(Raw!S23=\"\",\"\",Raw!S23)","v":"2024-04-30"},{"$f":"IF(Raw!T23=\"\",\"\",Raw!T23)","v":"法說會"},{"$f":"IF(Raw!W23=\"\",\"\",IF(Raw!W23=\"Y\",\"主動舉辦\",\"受邀參加\"))","v":"受邀參加"},{"$f":"IF(Raw!X23=\"\",\"\",Raw!X23)","v":"15:00"},{"$f":"IF(Raw!Z23=\"\",\"\",Raw!Z23)","v":"說明公司113年第一季財務及營運報告"},{"$f":"IF(Raw!Y23=\"\",\"\",Raw!Y23)","v":"線上法說會"},0]
[null,null,{"$f":"IF(Raw!R24=\"\",\"\",LEFT(Raw!R24,FIND(\" \",Raw!R24)-1))","v":"2395"},{"$f":"IF(Raw!U24=\"\",\"\",Raw!U24)","v":"研華"},{"$f":"IF(Raw!V24=\"\",\"\",Raw!V24)","v":"ACL"},{"$f":"IF(Raw!S24=\"\",\"\",Raw!S24)","v":"2024-04-30"},{"$f":"IF(Raw!T24=\"\",\"\",Raw!T24)","v":"法說會"},{"$f":"IF(Raw!W24=\"\",\"\",IF(Raw!W24=\"Y\",\"主動舉辦\",\"受邀參加\"))","v":"受邀參加"},{"$f":"IF(Raw!X24=\"\",\"\",Raw!X24)","v":"15:30"},{"$f":"IF(Raw!Z24=\"\",\"\",Raw!Z24)","v":"就公司113年第一季之財務數字、經營績效等資訊做相關說明"},{"$f":"IF(Raw!Y24=\"\",\"\",Raw!Y24)","v":"線上法說會"},0]
[null,null,{"$f":"IF(Raw!R25=\"\",\"\",LEFT(Raw!R25,FIND(\" \",Raw!R25)-1))","v":"1590"},{"$f":"IF(Raw!U25=\"\",\"\",Raw!U25)","v":"亞德客-KY"},{"$f":"IF(Raw!V25=\"\",\"\",Raw!V25)","v":"Airtac"},{"$f":"IF(Raw!S25=\"\",\"\",Raw!S25)","v":"2024-04-30"},{"$f":"IF(Raw!T25=\"\",\"\",Raw!T25)","v":"法說會"},{"$f":"IF(Raw!W25=\"\",\"\",IF(Raw!W25=\"Y\",\"主動舉辦\",\"受邀參加\"))","v":"受邀參加"},{"$f":"IF(Raw!X25=\"\",\"\",Raw!X25)","v":"16:00"},{"$f":"IF(Raw!Z25=\"\",\"\",Raw!Z25)","v":"公司簡介與營運狀況說明"},{"$f":"IF(Raw!Y25=\"\",\"\",Raw!Y25)","v":"線上法說會"},0]
[null,null,{"$f":"IF(Raw!R26=\"\",\"\",LEFT(Raw!R26,FIND(\" \",Raw!R26)-1))","v":"2337"},{"$f":"IF(Raw!U26=\"\",\"\",Raw!U26)","v":"旺宏"},{"$f":"IF(Raw!V26=\"\",\"\",Raw!V26)","v":"Macronix"},{"$f":"IF(Raw!S26=\"\",\"\",Raw!S26)","v":"2024-04-30"},{"$f":"IF(Raw!T26=\"\",\"\",Raw!T26)","v":"法說會"},{"$f":"IF(Raw!W26=\"\",\"\",IF(Raw!W26=\"Y\",\"主動舉辦\",\"受邀參加\"))","v":"受邀參加"},{"$f":"IF(Raw!X26=\"\",\"\",Raw!X26)","v":"16:00"},{"$f":"IF(Raw!Z26=\"\",\"\",Raw!Z26)","v":"旺宏電子2024年第一季營運成果報告"},{"$f":"IF(Raw!Y26=\"\",\"\",Raw!Y26)","v":"線上法說會"},0]
[null,null,{"$f":"IF(Raw!R27=\"\",\"\",LEFT(Raw!R27,FIND(\" \",Raw!R27)-1))","v":"2458"},{"$f":"IF(Raw!U27=\"\",\"\",Raw!U27)","v":"義隆"},{"$f":"IF(Raw!V27=\"\",\"\",Raw!V27)","v":"ELAN"},{"$f":"IF(Raw!S27=\"\",\"\",Raw!S27)","v":"2024-05-02"},{"$f":"IF(Raw!T27=\"\",\"\",Raw!T27)","v":"法說會"},{"$f":"IF(Raw!W27=\"\",\"\",IF(Raw!W27=\"Y\",\"主動舉辦\",\"受邀參加\"))","v":"主動舉辦"},{"$f":"IF(Raw!X27=\"\",\"\",Raw!X27)","v":"14:30"},{"$f":"IF(Raw!Z27=\"\",\"\",Raw!Z27)","v":"公司2024年第1季財務報告及第2季業績展望"},{"$f":"IF(Raw!Y27=\"\",\"\",Raw!Y27)","v":"線上法說會"},1]
[null,null,{"$f":"IF(Raw!R28=\"\",\"\",LEFT(Raw!R28,FIND(\" \",Raw!R28)-1))","v":"2308"},{"$f":"IF(Raw!U28=\"\",\"\",Raw!U28)","v":"台達電"},{"$f":"IF(Raw!V28=\"\",\"\",Raw!V28)","v":"DELTA"},{"$f":"IF(Raw!S28=\"\",\"\",Raw!S28)","v":"2024-05-02"},{"$f":"IF(Raw!T28=\"\",\"\",Raw!T28)","v":"法說會"},{"$f":"IF(Raw!W28=\"\",\"\",IF(Raw!W28=\"Y\",\"主動舉辦\",\"受邀參加\"))","v":"受邀參加"},{"$f":"IF(Raw!X28=\"\",\"\",Raw!X28)","v":"15:00"},{"$f":"IF(Raw!Z28=\"\",\"\",Raw!Z28)","v":"說明113年第1季財務報告相關資訊"},{"$f":"IF(Raw!Y28=\"\",\"\",Raw!Y28)","v":"台達電子瑞光大樓"},1]
[null,null,{"$f":"IF(Raw!R29=\"\",\"\",LEFT(Raw!R29,FIND(\" \",Raw!R29)-1))","v":"2412"},{"$f":"IF(Raw!U29=\"\",\"\",Raw!U29)","v":"中華電"},{"$f":"IF(Raw!V29=\"\",\"\",Raw!V29)","v":"CHT"},{"$f":"IF(Raw!S29=\"\",\"\",Raw!S29)","v":"2024-05-02"},{"$f":"IF(Raw!T29=\"\",\"\",Raw!T29)","v":"法說會"},{"$f":"IF(Raw!W29=\"\",\"\",IF(Raw!W29=\"Y\",\"主動舉辦\",\"受邀參加\"))","v":"受邀參加"},{"$f":"IF(Raw!X29=\"\",\"\",Raw!X29)","v":"15:00"},{"$f":"IF(Raw!Z29=\"\",\"\",Raw!Z29)","v":"113年第1季營運成果"},{"$f":"IF(Raw!Y29=\"\",\"\",Raw!Y29)","v":"電話會議"},1]
[null,null,{"$f":"IF(Raw!R30=\"\",\"\",LEFT(Raw!R30,FIND(\" \",Raw!R30)-1))","v":"6412"},{"$f":"IF(Raw!U30=\"\",\"\",Raw!U30)","v":"群電"},{"$f":"IF(Raw!V30=\"\",\"\",Raw!V30)","v":"Chicony Power"},{"$f":"IF(Raw!S30=\"\",\"\",Raw!S30)","v":"2024-05-02"},{"$f":"IF(Raw!T30=\"\",\"\",Raw!T30)","v":"法說會"},{"$f":"IF(Raw!W30=\"\",\"\",IF(Raw!W30=\"Y\",\"主動舉辦\",\"受邀參加\"))","v":"受邀參加"},{"$f":"IF(Raw!X30=\"\",\"\",Raw!X30)","v":"15:00"},{"$f":"IF(Raw!Z30=\"\",\"\",Raw!Z30)","v":"說明公司2024年第1季營運成果"},{"$f":"IF(Raw!Y30=\"\",\"\",Raw!Y30)","v":"台北市中山區樂群三路128號7樓"},1]
{"$rows_left_out":9}
{"sheet":"Raw","index":1,"n_rows":2250,"n_cols":28,"rows_kept":2250,"cut":false,"hidden":false,"merged":[]}
["公司","事件日","事件類別","公司中文簡稱","公司英文簡稱","事件註記","時間","開會地點","內容說明1","內容說明2","內容說明3",null,null,"事件類別",null,"事件類別",null,"公司","事件日","事件類別","公司中文簡稱","公司英文簡稱","事件註記","時間","開會地點","內容說明1","內容說明2","內容說明3"]
["1102 亞泥","2024-04-25","資券恢復日","亞泥","ACC",null,null,null,"於 2024/06/25:股東會(常會)",null,null,null,1,"法說會",null,{"$f":"IFERROR(VLOOKUP(Report!$A$1,Raw!M:N,2,0),\"\")","v":"法說會"},null,"1720 生達","2024-04-25","法說會","生達","S.C.P.C","YL","14:00","台北市敦化南路二段97號11樓（敦南摩天大廈-元富證券11樓教育訓練室）","112年度營運概況說明"]
["1201 味全","2024-04-25","資券恢復日","味全","WEI CHUAN",null,null,null,"於 2024/06/27:股東會(常會)",null,null,null,2,"股東常會",null,null,null,"2762 世界健身-KY","2024-04-25","法說會","世界健身-KY","World Gym","NL","14:00","台北市南京東路三段219號11樓","受邀請參加元大證券舉辦之法人說明會"]
["1203 味王","2024-04-25","資券恢復日","味王","Ve Wong",null,null,null,"於 2024/06/26:股東會(常會)",null,null,null,3,"股東臨時會",null,null,null,"5013 強新","2024-04-25","法說會","強新","New Best","N","14:00","線上法說會","參加元大證券舉辦之線上法說會"]
["1215 卜蜂","2024-04-25","資券恢復日","卜蜂","CPE",null,null,null,"於 2024/06/25:股東會(常會)",null,null,null,4,"現增除權日",null,null,null,"3147 大綜","2024-04-25","法說會","大綜","Jetwell","NL","14:30","奔亞會議中心206廳(台北市復興北路99號2樓)","說明公司營運狀況"]
["1216 統一","2024-04-25","資券恢復日","統一","Uni-President",null,null,null,"於 2024/06/27:股東會(常會)",null,null,null,5,"資券恢復日",null,null,null,"5203 訊連","2024-04-25","法說會","訊連","Cyberlink","YL","14:30","線上法說會","會中報告113年第一季度經營成果"]
["1220 台榮","2024-04-25","資券恢復日","台榮","Tairoun",null,null,null,"於 2024/06/27:股東會(常會)",null,null,null,6,"融券回補日",null,null,null,"3105 穩懋","2024-04-26","法說會","穩懋","Win","YL","14:00","線上法說會","舉辦2024年第一季線上法人說明會，說明本公司營運狀況。"]
["1225 福懋油","2024-04-25","資券恢復日","福懋油","FOPCO",null,null,null,"於 2024/06/26:股東會(常會)",null,null,null,7,"停券日",null,null,null,"2439 美律","2024-04-26","法說會","美律","Merry","N","15:00","線上法說會","公布公司 2024年第1季營運成果"]
["1402 遠東新","2024-04-25","資券恢復日","遠東新","FENC",null,null,null,"於 2024/06/27:股東會(常會)",null,null,null,8,"除息日",null,null,null,"2454 聯發科","2024-04-26","法說會","聯發科","MTK","Y","15:00","線上法說會","2024年第1季財務報告及2024年第2季業績展望"]
["1418 東華","2024-04-25","資券恢復日","東華","TongHwa",null,null,null,"於 2024/06/25:股東會(常會)",null,null,null,9,"首次上市櫃日",null,null,null,"4968 立積","2024-04-26","法說會","立積","RichWave","Y","15:30","線上法說會"]
["1438 三地開發","2024-04-25","資券恢復日","三地開發","SanDi",null,null,null,"於 2024/06/26:股東會(常會)",null,null,null,null,null,null,null,null,"4915 致伸","2024-04-29","法說會","致伸","Primax","NL","14:30","國票金控大樓 (台北市樂群三路128號7樓)","說明營運成果及未來展望"]
["1439 雋揚","2024-04-25","資券恢復日","雋揚","Ascent",null,null,null,"於 2024/06/27:股東會(常會)",null,null,null,null,null,null,null,null,"6269 台郡","2024-04-29","法說會","台郡","Flexium","NL","14:30","元大證券寶慶大樓4樓會議室(台北市寶慶路69號)","說明公司113年第1季營運成果"]
["1449 佳和","2024-04-25","資券恢復日","佳和","Chia Her",null,null,null,"於 2024/06/25:股東會(常會)",null,null,null,null,null,null,null,null,"6792 詠業","2024-04-29","法說會","詠業","Unictron","N","15:00","線上法說會","說明113年度第1季營業成果及未來營運展望"]
["1463 強盛","2024-04-25","資券恢復日","強盛","CS",null,null,null,"於 2024/06/25:股東會(常會)",null,null,null,null,null,null,null,null,"2015 豐興","2024-04-30","法說會","豐興","FH","NL","14:00","線上法說會","受邀參加國票綜合證券法人說明會，報名請洽國票綜合證券李小姐02-25288275 Email:ann","eli@ibfs.com.tw"]
["1470 大統新創","2024-04-25","資券恢復日","大統新創","Evertex",null,null,null,"於 2024/06/25:股東會(常會)",null,null,null,null,null,null,null,null,"2301 光寶科","2024-04-30","法說會","光寶科","LTC","YL","14:00","本公司(臺北市內湖區瑞光路392號1樓國際會議廳)","公司113年第1季財務業務情形"]
["1474 弘裕","2024-04-25","資券恢復日","弘裕","HONMYUE",null,null,null,"於 2024/06/26:股東會(常會)",null,null,null,null,null,null,null,null,"2409 友達","2024-04-30","法說會","友達","AUO","Y","14:00","線上法說會"]
["1475 業旺","2024-04-25","資券恢復日","業旺","Big SunShine",null,null,null,"於 2024/06/25:股東會(常會)",null,null,null,null,null,null,null,null,"5347 世界","2024-04-30","法說會","世界","VIS","Y","14:00","線上法說會","2024年第一季的財務結果以及對2024年第二季的營運展望"]
["1514 亞力","2024-04-25","資券恢復日","亞力","AEC",null,null,null,"於 2024/06/26:股東會(常會)",null,null,null,null,null,null,null,null,"3479 安勤","2024-04-30","法說會","安勤","Avalue","YL","14:30","凱基證券股份有限公司(台北市明水路700號)","公司112年度財務業務狀況"]
["1517 利奇","2024-04-25","資券恢復日","利奇","Lee Chi",null,null,null,"於 2024/06/25:股東會(常會)",null,null,null,null,null,null,null,null,"5258 虹堡","2024-04-30","法說會","虹堡","Castles","NL","14:30","台北市中山區建國北路一段96號B1會議室","說明公司近期營運成果與未來展望"]
["1532 勤美","2024-04-25","資券恢復日","勤美","CMP",null,null,null,"於 2024/06/25:股東會(常會)",null,null,null,null,null,null,null,null,"6202 盛群","2024-04-30","法說會","盛群","Holtek","YL","14:30","宏遠證券總公司(台北市大安區信義路四段236號7樓)","公司113年第1季財務與業務營運相關資訊報告"]
["1535 中宇","2024-04-25","資券恢復日","中宇","CEC",null,null,null,"於 2024/06/25:股東會(常會)",null,null,null,null,null,null,null,null,"6239 力成","2024-04-30","法說會","力成","PTI","YL","14:30","新竹縣湖口鄉新竹工業區大同路15號6樓(訓練教室)","報告113年第一季營運成果及未來之營運展望"]
["1540 喬福","2024-04-25","資券恢復日","喬福","ROUNDTOP",null,null,null,"於 2024/06/25:股東會(常會)",null,null,null,null,null,null,null,null,"6510 精測","2024-04-30","法說會","精測","CHPT","Y","14:30","線上法說會","報告公司營運成果"]
["1615 大山","2024-04-25","資券恢復日","大山","DAH SAN",null,null,null,"於 2024/06/26:股東會(常會)",null,null,null,null,null,null,null,null,"5371 中光電","2024-04-30","法說會","中光電","Coretronic","YL","15:00","線上法說會","說明公司113年第一季財務及營運報告"]
["1717 長興","2024-04-25","除息日","長興","Eternal",null,null,null,null,null,null,null,null,null,null,null,null,"2395 研華","2024-04-30","法說會","研華","ACL","N","15:30","線上法說會","就公司113年第一季之財務數字、經營績效等資訊做相關說明"]
["1717 長興","2024-04-25","資券恢復日","長興","Eternal",null,null,null,"於 2024/04/25:現金股息；於 2024/06/25:股東會(常會)",null,null,null,null,null,null,null,null,"1590 亞德客-KY","2024-04-30","法說會","亞德客-KY","Airtac","N","16:00","線上法說會","公司簡介與營運狀況說明"]
["1722 台肥","2024-04-25","資券恢復日","台肥","TFC",null,null,null,"於 2024/06/26:股東會(常會)",null,null,null,null,null,null,null,null,"2337 旺宏","2024-04-30","法說會","旺宏","Macronix","YL","16:00","線上法說會","旺宏電子2024年第一季營運成果報告"]
["1735 日勝化","2024-04-25","資券恢復日","日勝化","EMC",null,null,null,"於 2024/06/27:股東會(常會)",null,null,null,null,null,null,null,null,"2458 義隆","2024-05-02","法說會","義隆","ELAN","Y","14:30","線上法說會","公司2024年第1季財務報告及第2季業績展望"]
["1736 喬山","2024-04-25","資券恢復日","喬山","JHT",null,null,null,"於 2024/06/26:股東會(常會)",null,null,null,null,null,null,null,null,"2308 台達電","2024-05-02","法說會","台達電","DELTA","YL","15:00","台達電子瑞光大樓","說明113年第1季財務報告相關資訊"]
["1786 科妍","2024-04-25","資券恢復日","科妍","SVBI",null,null,null,"於 2024/06/26:股東會(常會)",null,null,null,null,null,null,null,null,"2412 中華電","2024-05-02","法說會","中華電","CHT","YL","15:00","電話會議","113年第1季營運成果"]
["1810 和成","2024-04-25","資券恢復日","和成","HCG",null,null,null,"於 2024/06/26:股東會(常會)",null,null,null,null,null,null,null,null,"6412 群電","2024-05-02","法說會","群電","Chicony Power","NL","15:00","台北市中山區樂群三路128號7樓","說明公司2024年第1季營運成果"]
{"$rows_left_out":2220}