{"text_format":"1","workbook":"xlsx","n_sheets":8,"sheets":["基金綜合報表","基金屬性","淨值及報酬","風險控管","基金PROFILE","投資組合-個股別","投資組合-產品別","圖型"],"not_rendered":{"charts":4,"images":0,"macros":1,"external_links":0,"defined_names":19,"comments":7,"pivot_tables":0},"unopened":[],"bounds":{"document_bytes":16777216,"sheet_cells":100000,"rows_first":2000,"rows_last":500,"rows_between":2000,"halvings":0,"cell_chars":16384,"cell_head_chars":4096},"cells_cut":0,"cells_raw":0,"read":"whole","date_system":"1900"}

{"sheet":"基金綜合報表","index":0,"n_rows":73,"n_cols":15,"rows_kept":73,"cut":false,"hidden":false,"merged":[[11,1,11,2],[13,7,13,8],[13,1,13,2],[13,3,13,4],[14,7,14,8],[14,3,14,4],[11,5,11,6],[12,5,12,6],[13,5,13,6],[12,3,12,4],[11,3,11,4],[45,0,45,4],[13,9,13,11],[17,0,18,1],[14,1,14,2],[16,0,16,4],[1,13,1,14],[2,1,2,2],[2,4,2,6],[14,9,14,11],[3,5,3,11],[8,1,8,6],[8,8,8,11],[10,5,10,6],[11,7,11,8],[12,1,12,2],[4,4,4,6],[5,1,5,6],[14,5,14,6],[10,7,10,8],[12,7,12,8],[9,7,9,8],[7,1,7,2],[2,8,2,11],[3,1,3,4],[10,1,10,2],[1,0,1,11],[4,1,4,3],[9,1,9,2],[9,5,9,6],[10,3,10,4],[7,4,7,5],[7,9,7,10],[6,3,6,4],[6,5,6,6],[9,9,9,10],[5,13,5,14],[10,13,10,14],[10,9,10,11],[11,9,11,11],[12,9,12,11]]}
["00878","<<請輸入欲查詢的基金代碼(英文字請輸入大寫)，然後按[REFRESH]更新版面"]
["基金基本資料",null,null,null,null,null,null,null,null,null,null,null,null,"風險控管"]
["　基金代碼",{"$f":"LEFT(基金屬性!A1,FIND(\" \",基金屬性!A1))","v":"00878 "},null,"基金簡稱",{"$f":"MID(基金屬性!A1,FIND(\" \",基金屬性!A1)+1,10)","v":"國泰永續高股息"},null,null,"統    編",{"$f":"RIGHT(REPT(0,8)&基金屬性!A3,8)","v":"88090913"},null,null,null,null,"資料日期",{"$f":"TEXT(淨值及報酬!B2,\"YYYY/MM/DD\")","v":"2024/10/30"}]
["　中/英文名稱",{"$f":"基金屬性!B3","v":"國泰台灣高股息傘型證券投資信託基金之台灣ESG永續高股息ETF證券投資信託基金"},null,null,null,{"$f":"基金屬性!C3","v":"Cathay MSCI Taiwan ESG Sustainability High Dividend Yield ETF"},null,null,null,null,null,null,null,"淨值(元)",{"$f":"淨值及報酬!B3","v":22.75}]
["　現任基金經理人",{"$f":"IF(基金屬性!D3=\"\",\"\",基金屬性!D3)","v":"游日傑(2021/03/01到任)"},null,null,{"$f":"IF(基金屬性!E3=\"\",\"\",基金屬性!E3)","v":""},null,null,"經理費",{"$f":"IF(基金屬性!O3=\"\",\"\",基金屬性!O3)","v":0.25},"~",{"$f":"IF(基金屬性!N3=\"\",\"\",基金屬性!N3)","v":0.3},"%",null,"日報酬率%",{"$f":"淨值及報酬!B4","v":-0.56818199999999996}]
["　基金類型",{"$f":"IF(基金屬性!F3=\"\",\"\",基金屬性!F3)","v":"國內指數-一般ETF"},null,null,null,null,null,"保管費",{"$f":"IF(基金屬性!Q3=\"\",\"\",基金屬性!Q3)","v":""},"~",{"$f":"IF(基金屬性!P3=\"\",\"\",基金屬性!P3)","v":0.03},"%",null,"12個月"]
["　傘狀基金",{"$f":"基金屬性!G3","v":"Y"},"成員",{"$f":"IF($B$7=\"N\",\"\",基金屬性!H3)","v":"T3786A 國泰台灣高股息傘型證券投資信託基金之台灣高股息證券投資信託基金 A類型新臺幣"},null,{"$f":"IF($B$7=\"N\",\"\",基金屬性!I3)","v":0},null,"銷售費",{"$f":"IF(基金屬性!S3=\"\",\"\",基金屬性!S3)","v":0},"~",{"$f":"IF(基金屬性!R3=\"\",\"\",基金屬性!R3)","v":2},"%",null,"年化標準差",{"$f":"IF(風險控管!B3=\"\",IF(風險控管!C3=\"\",\"\",風險控管!C3),風險控管!B3)","v":13.2646}]
["　成立資產",{"$f":"基金屬性!J3","v":6769050},null,"(千元)",{"$f":"TEXT(基金屬性!K3,\"YYYY/MM/DD\")","v":"2020/07/10"},null,"成立","贖回費","每筆",{"$f":"IF(基金屬性!T3=\"\",\"\",基金屬性!T3)","v":0},null,"元",null,"BETA值",{"$f":"IF(風險控管!B4=\"\",IF(風險控管!C4=\"\",\"\",風險控管!C4),風險控管!B4)","v":0.75180000000000002}]
["　型        態",{"$f":"基金屬性!L3","v":"國內募集,投資國內"},null,null,null,null,null,"標    的",{"$f":"基金屬性!M3","v":"ETF"},null,null,null,null,"SHARPE值",{"$f":"IF(風險控管!B5=\"\",IF(風險控管!C5=\"\",\"\",風險控管!C5),風險控管!B5)","v":0.50690000000000002}]
["　基金淨資產",{"$f":"淨值及報酬!E3","v":323292924},null,"(千元)   資料時間",null,{"$f":"TEXT(淨值及報酬!E2,\"YYYY/MM/DD\")","v":"2024/09/30"},null," 受益人大會費用",null,{"$f":"IF(基金屬性!U3=\"\",\"\",基金屬性!U3)","v":100},null,"萬元",null,"IR值",{"$f":"IF(風險控管!B6=\"\",IF(風險控管!C6=\"\",\"\",風險控管!C6),風險控管!B6)","v":-0.2014}]
[null,"ㄧ個月",null,"三個月",null,"六個月",null,"ㄧ年",null,"三年",null,null,null,"24個月"]
["同類基金排名",{"$f":"IF(基金PROFILE!B3=\"\",\"\",基金PROFILE!B3)&\"/\"&IF(基金PROFILE!C3=\"\",\"\",基金PROFILE!C3)","v":"27/55"},null,{"$f":"IF(基金PROFILE!D3=\"\",\"\",基金PROFILE!D3)&\"/\"&IF(基金PROFILE!E3=\"\",\"\",基金PROFILE!E3)","v":"29/54"},null,{"$f":"IF(基金PROFILE!F3=\"\",\"\",基金PROFILE!F3)&\"/\"&IF(基金PROFILE!G3=\"\",\"\",基金PROFILE!G3)","v":"30/52"},null,{"$f":"IF(基金PROFILE!H3=\"\",\"\",基金PROFILE!H3)&\"/\"&IF(基金PROFILE!I3=\"\",\"\",基金PROFILE!I3)","v":"38/48"},null,{"$f":"IF(基金PROFILE!J3=\"\",\"\",基金PROFILE!J3)&\"/\"&IF(基金PROFILE!K3=\"\",\"\",基金PROFILE!K3)","v":"11/27"},null,null,null,"年化標準差",{"$f":"IF(風險控管!B7=\"\",IF(風險控管!C7=\"\",\"\",風險控管!C7),風險控管!B7)","v":15.904199999999999}]
["報酬率%",{"$f":"IF(基金PROFILE!B6=\"\",\"\",基金PROFILE!B6)","v":1.021315},null,{"$f":"IF(基金PROFILE!C6=\"\",\"\",基金PROFILE!C6)","v":1.648911},null,{"$f":"IF(基金PROFILE!D6=\"\",\"\",基金PROFILE!D6)","v":7.4697930000000001},null,{"$f":"IF(基金PROFILE!E6=\"\",\"\",基金PROFILE!E6)","v":25.217426},null,{"$f":"IF(基金PROFILE!F6=\"\",\"\",基金PROFILE!F6)","v":53.820667},null,null,null,"BETA值",{"$f":"IF(風險控管!B8=\"\",IF(風險控管!C8=\"\",\"\",風險控管!C8),風險控管!B8)","v":0.68410000000000004}]
[null,null,null,null,null,null,null,null,null,null,null,null,null,"SHARPE值",{"$f":"IF(風險控管!B9=\"\",IF(風險控管!C9=\"\",\"\",風險控管!C9),風險控管!B9)","v":0.4672}]
[null,null,null,null,null,null,null,null,null,null,null,null,null,"IR值",{"$f":"IF(風險控管!B10=\"\",IF(風險控管!C10=\"\",\"\",風險控管!C10),風險控管!B10)","v":-0.15939999999999999}]
[]
["基金投資組合－產業別"]
["產業別",null,"投資率","比上月","比重"]
[null,null,"%","增減%","排名"]
[{"$f":"IF(OR('投資組合-產品別'!$B3=\"\",'投資組合-產品別'!$B3=0),\"\",'投資組合-產品別'!$A3)","v":"M2800 金融保險"},null,{"$f":"IF($A20=\"\",\"\",VLOOKUP($A20,XX_TEJ14,2,FALSE))","v":23.39},{"$f":"IF($A20=\"\",\"\",VLOOKUP($A20,'投資組合-產品別'!$A:$G,7,FALSE))","v":-5.0000000000000711E-2},{"$f":"IF(A20=\"\",\"\",1)","v":1}]
[{"$f":"IF(OR('投資組合-產品別'!$B4=\"\",'投資組合-產品別'!$B4=0),\"\",'投資組合-產品別'!$A4)","v":"M2325 電腦及週邊設備業"},null,23.16,{"$f":"IF($A21=\"\",\"\",VLOOKUP($A21,'投資組合-產品別'!$A:$G,7,FALSE))","v":1.2100000000000009},{"$f":"IF(A21=\"\",\"\",E20+1)","v":2}]
[{"$f":"IF(OR('投資組合-產品別'!$B5=\"\",'投資組合-產品別'!$B5=0),\"\",'投資組合-產品別'!$A5)","v":"M2324 半導體業"},null,20.28,{"$f":"IF($A22=\"\",\"\",VLOOKUP($A22,'投資組合-產品別'!$A:$G,7,FALSE))","v":-0.32999999999999829},{"$f":"IF(A22=\"\",\"\",E21+1)","v":3}]
[{"$f":"IF(OR('投資組合-產品別'!$B6=\"\",'投資組合-產品別'!$B6=0),\"\",'投資組合-產品別'!$A6)","v":"M2327 通訊網路業"},null,8.9,{"$f":"IF($A23=\"\",\"\",VLOOKUP($A23,'投資組合-產品別'!$A:$G,7,FALSE))","v":-0.36999999999999922},{"$f":"IF(A23=\"\",\"\",E22+1)","v":4}]
[{"$f":"IF(OR('投資組合-產品別'!$B7=\"\",'投資組合-產品別'!$B7=0),\"\",'投資組合-產品別'!$A7)","v":"M2331 其他電子業"},null,4.2,{"$f":"IF($A24=\"\",\"\",VLOOKUP($A24,'投資組合-產品別'!$A:$G,7,FALSE))","v":-9.9999999999997868E-3},5]
[{"$f":"IF(OR('投資組合-產品別'!$B8=\"\",'投資組合-產品別'!$B8=0),\"\",'投資組合-產品別'!$A8)","v":"M1400 紡織纖維"},null,3.27,{"$f":"IF($A25=\"\",\"\",VLOOKUP($A25,'投資組合-產品別'!$A:$G,7,FALSE))","v":-6.999999999999984E-2},6]
[{"$f":"IF(OR('投資組合-產品別'!$B9=\"\",'投資組合-產品別'!$B9=0),\"\",'投資組合-產品別'!$A9)","v":"M2329 電子通路業"},null,3.22,{"$f":"IF($A26=\"\",\"\",VLOOKUP($A26,'投資組合-產品別'!$A:$G,7,FALSE))","v":-3.9999999999999591E-2},7]
[{"$f":"IF(OR('投資組合-產品別'!$B10=\"\",'投資組合-產品別'!$B10=0),\"\",'投資組合-產品別'!$A10)","v":"O2324 OTC 半導體業"},null,3.2,{"$f":"IF($A27=\"\",\"\",VLOOKUP($A27,'投資組合-產品別'!$A:$G,7,FALSE))","v":-7.9999999999999627E-2},8]
[{"$f":"IF(OR('投資組合-產品別'!$B11=\"\",'投資組合-產品別'!$B11=0),\"\",'投資組合-產品別'!$A11)","v":"M1200 食品工業"},null,3.05,{"$f":"IF($A28=\"\",\"\",VLOOKUP($A28,'投資組合-產品別'!$A:$G,7,FALSE))","v":-3.0000000000000249E-2},9]
[{"$f":"IF(OR('投資組合-產品別'!$B12=\"\",'投資組合-產品別'!$B12=0),\"\",'投資組合-產品別'!$A12)","v":"M1100 水泥工業"},null,2.34,{"$f":"IF($A29=\"\",\"\",VLOOKUP($A29,'投資組合-產品別'!$A:$G,7,FALSE))","v":-0.12000000000000011},10]
[{"$f":"IF(OR('投資組合-產品別'!$B13=\"\",'投資組合-產品別'!$B13=0),\"\",'投資組合-產品別'!$A13)","v":"M2100 橡膠工業"},null,2.0299999999999998,{"$f":"IF($A30=\"\",\"\",VLOOKUP($A30,'投資組合-產品別'!$A:$G,7,FALSE))","v":-0.14000000000000012},11]
[{"$f":"IF(OR('投資組合-產品別'!$B14=\"\",'投資組合-產品別'!$B14=0),\"\",'投資組合-產品別'!$A14)","v":"ZCC   存放金融機"},null,1.66,{"$f":"IF($A31=\"\",\"\",VLOOKUP($A31,'投資組合-產品別'!$A:$G,7,FALSE))","v":0.22999999999999998},12]
[{"$f":"IF(OR('投資組合-產品別'!$B15=\"\",'投資組合-產品別'!$B15=0),\"\",'投資組合-產品別'!$A15)","v":"ZBB   附條件債券"},null,0.44,{"$f":"IF($A32=\"\",\"\",VLOOKUP($A32,'投資組合-產品別'!$A:$G,7,FALSE))","v":-1.0000000000000009E-2},13]
[{"$f":"IF(OR('投資組合-產品別'!$B16=\"\",'投資組合-產品別'!$B16=0),\"\",'投資組合-產品別'!$A16)","v":""},null,"",{"$f":"IF($A33=\"\",\"\",VLOOKUP($A33,'投資組合-產品別'!$A:$G,7,FALSE))","v":""},{"$f":"IF(A33=\"\",\"\",E32+1)","v":""}]
[{"$f":"IF(OR('投資組合-產品別'!$B17=\"\",'投資組合-產品別'!$B17=0),\"\",'投資組合-產品別'!$A17)","v":""},null,"",{"$f":"IF($A34=\"\",\"\",VLOOKUP($A34,'投資組合-產品別'!$A:$G,7,FALSE))","v":""},""]
[{"$f":"IF(OR('投資組合-產品別'!$B18=\"\",'投資組合-產品別'!$B18=0),\"\",'投資組合-產品別'!$A18)","v":""},null,"",{"$f":"IF($A35=\"\",\"\",VLOOKUP($A35,'投資組合-產品別'!$A:$G,7,FALSE))","v":""},""]
[{"$f":"IF(OR('投資組合-產品別'!$B19=\"\",'投資組合-產品別'!$B19=0),\"\",'投資組合-產品別'!$A19)","v":""},null,"",{"$f":"IF($A36=\"\",\"\",VLOOKUP($A36,'投資組合-產品別'!$A:$G,7,FALSE))","v":""},""]
[{"$f":"IF(OR('投資組合-產品別'!$B20=\"\",'投資組合-產品別'!$B20=0),\"\",'投資組合-產品別'!$A20)","v":""},null,"",{"$f":"IF($A37=\"\",\"\",VLOOKUP($A37,'投資組合-產品別'!$A:$G,7,FALSE))","v":""},""]
[{"$f":"IF(OR('投資組合-產品別'!$B21=\"\",'投資組合-產品別'!$B21=0),\"\",'投資組合-產品別'!$A21)","v":""},null,"",{"$f":"IF($A38=\"\",\"\",VLOOKUP($A38,'投資組合-產品別'!$A:$G,7,FALSE))","v":""},""]
[{"$f":"IF(OR('投資組合-產品別'!$B22=\"\",'投資組合-產品別'!$B22=0),\"\",'投資組合-產品別'!$A22)","v":""},null,"",{"$f":"IF($A39=\"\",\"\",VLOOKUP($A39,'投資組合-產品別'!$A:$G,7,FALSE))","v":""},""]
[{"$f":"IF(OR('投資組合-產品別'!$B23=\"\",'投資組合-產品別'!$B23=0),\"\",'投資組合-產品別'!$A23)","v":""},null,"",{"$f":"IF($A40=\"\",\"\",VLOOKUP($A40,'投資組合-產品別'!$A:$G,7,FALSE))","v":""},""]
[{"$f":"IF(OR('投資組合-產品別'!$B24=\"\",'投資組合-產品別'!$B24=0),\"\",'投資組合-產品別'!$A24)","v":""},null,"",{"$f":"IF($A41=\"\",\"\",VLOOKUP($A41,'投資組合-產品別'!$A:$G,7,FALSE))","v":""},""]
["現金部位估計",null,{"$f":"'投資組合-產品別'!B84","v":2.9599999999999937},{"$f":"'投資組合-產品別'!G84","v":2.9999999999986926E-2},"--"]
["國內合計",null,{"$f":"'投資組合-產品別'!B83","v":97.04},{"$f":"'投資組合-產品別'!G83","v":-2.9999999999986926E-2},"--"]
["國外合計",null,{"$f":"'投資組合-產品別'!B82","v":0},{"$f":"'投資組合-產品別'!G82","v":0},"--"]
[]
["基金投資組合－個股別"]
["證券別","投資率","持股數/","個股","比重"]
[{"$f":"IF(A49=\"\",\"本月未公告個股\",\"\")","v":""},"%","流通在外","月報酬%","排名"]
[{"$f":"IF(OR('投資組合-個股別'!$A4=\"\",LEFT('投資組合-個股別'!$A4,1)=\"M\",LEFT('投資組合-個股別'!$A4,1)=\"T\"),\"\",'投資組合-個股別'!$A4)","v":"2454"},{"$f":"IF($A49=\"\",\"\",VLOOKUP($A49,XX_TEJ16,2,FALSE))","v":4.7300000000000004},{"$f":"IF($A49=\"\",\"\",VLOOKUP($A49,XX_TEJ16,3,FALSE))","v":0.81},{"$f":"IF($A49=\"\",\"\",VLOOKUP($A49,XX_TEJ16,4,FALSE))","v":-5.2417999999999996},{"$f":"IF($A49=\"\",\"\",1)","v":1}]
[{"$f":"IF(OR('投資組合-個股別'!$A5=\"\",LEFT('投資組合-個股別'!$A5,1)=\"M\",LEFT('投資組合-個股別'!$A5,1)=\"T\"),\"\",'投資組合-個股別'!$A5)","v":"3034"},4.72,4.84,-4.0740999999999996,{"$f":"IF($A50=\"\",\"\",E49+1)","v":2}]
[{"$f":"IF(OR('投資組合-個股別'!$A6=\"\",LEFT('投資組合-個股別'!$A6,1)=\"M\",LEFT('投資組合-個股別'!$A6,1)=\"T\"),\"\",'投資組合-個股別'!$A6)","v":"2474"},4.29,8.6199999999999992,0.21190000000000001,{"$f":"IF($A51=\"\",\"\",E50+1)","v":3}]
[{"$f":"IF(OR('投資組合-個股別'!$A7=\"\",LEFT('投資組合-個股別'!$A7,1)=\"M\",LEFT('投資組合-個股別'!$A7,1)=\"T\"),\"\",'投資組合-個股別'!$A7)","v":"2303"},3.88,1.86,-3.0634000000000001,4]
[{"$f":"IF(OR('投資組合-個股別'!$A8=\"\",LEFT('投資組合-個股別'!$A8,1)=\"M\",LEFT('投資組合-個股別'!$A8,1)=\"T\"),\"\",'投資組合-個股別'!$A8)","v":"2882"},3.83,1.27,4.7244000000000002,5]
[{"$f":"IF(OR('投資組合-個股別'!$A9=\"\",LEFT('投資組合-個股別'!$A9,1)=\"M\",LEFT('投資組合-個股別'!$A9,1)=\"T\"),\"\",'投資組合-個股別'!$A9)","v":"3711"},3.65,1.77,-1.6285000000000001,6]
[{"$f":"IF(OR('投資組合-個股別'!$A10=\"\",LEFT('投資組合-個股別'!$A10,1)=\"M\",LEFT('投資組合-個股別'!$A10,1)=\"T\"),\"\",'投資組合-個股別'!$A10)","v":"2881"},3.61,0.94,3.2860999999999998,7]
[{"$f":"IF(OR('投資組合-個股別'!$A11=\"\",LEFT('投資組合-個股別'!$A11,1)=\"M\",LEFT('投資組合-個股別'!$A11,1)=\"T\"),\"\",'投資組合-個股別'!$A11)","v":"2377"},3.45,7.59,-5.1772,8]
[{"$f":"IF(OR('投資組合-個股別'!$A12=\"\",LEFT('投資組合-個股別'!$A12,1)=\"M\",LEFT('投資組合-個股別'!$A12,1)=\"T\"),\"\",'投資組合-個股別'!$A12)","v":"2301"},3.43,4.75,-7.0094000000000003,9]
[{"$f":"IF(OR('投資組合-個股別'!$A13=\"\",LEFT('投資組合-個股別'!$A13,1)=\"M\",LEFT('投資組合-個股別'!$A13,1)=\"T\"),\"\",'投資組合-個股別'!$A13)","v":"1402"},3.4,5.35,5.9310999999999998,10]
[{"$f":"IF(OR('投資組合-個股別'!$A14=\"\",LEFT('投資組合-個股別'!$A14,1)=\"M\",LEFT('投資組合-個股別'!$A14,1)=\"T\"),\"\",'投資組合-個股別'!$A14)","v":"2324"},3.4,7.49,0.30149999999999999,11]
[{"$f":"IF(OR('投資組合-個股別'!$A15=\"\",LEFT('投資組合-個股別'!$A15,1)=\"M\",LEFT('投資組合-個股別'!$A15,1)=\"T\"),\"\",'投資組合-個股別'!$A15)","v":"4904"},3.38,3.34,0.221,12]
[{"$f":"IF(OR('投資組合-個股別'!$A16=\"\",LEFT('投資組合-個股別'!$A16,1)=\"M\",LEFT('投資組合-個股別'!$A16,1)=\"T\"),\"\",'投資組合-個股別'!$A16)","v":"2382"},3.35,1.06,-1.4923,13]
[{"$f":"IF(OR('投資組合-個股別'!$A17=\"\",LEFT('投資組合-個股別'!$A17,1)=\"M\",LEFT('投資組合-個股別'!$A17,1)=\"T\"),\"\",'投資組合-個股別'!$A17)","v":"5347"},3.34,6.37,-15.8537,14]
[{"$f":"IF(OR('投資組合-個股別'!$A18=\"\",LEFT('投資組合-個股別'!$A18,1)=\"M\",LEFT('投資組合-個股別'!$A18,1)=\"T\"),\"\",'投資組合-個股別'!$A18)","v":"3045"},3.27,2.4700000000000002,2.6783999999999999,15]
[{"$f":"IF(OR('投資組合-個股別'!$A19=\"\",LEFT('投資組合-個股別'!$A19,1)=\"M\",LEFT('投資組合-個股別'!$A19,1)=\"T\"),\"\",'投資組合-個股別'!$A19)","v":"2379"},3.21,4.3,-9.1692999999999998,16]
[{"$f":"IF(OR('投資組合-個股別'!$A20=\"\",LEFT('投資組合-個股別'!$A20,1)=\"M\",LEFT('投資組合-個股別'!$A20,1)=\"T\"),\"\",'投資組合-個股別'!$A20)","v":"3702"},3.2,8.2200000000000006,-7.6353999999999997,17]
[{"$f":"IF(OR('投資組合-個股別'!$A21=\"\",LEFT('投資組合-個股別'!$A21,1)=\"M\",LEFT('投資組合-個股別'!$A21,1)=\"T\"),\"\",'投資組合-個股別'!$A21)","v":"2885"},3.15,2.48,-0.627,18]
[{"$f":"IF(OR('投資組合-個股別'!$A22=\"\",LEFT('投資組合-個股別'!$A22,1)=\"M\",LEFT('投資組合-個股別'!$A22,1)=\"T\"),\"\",'投資組合-個股別'!$A22)","v":"3231"},3.12,3.45,-0.49249999999999999,19]
[{"$f":"IF(OR('投資組合-個股別'!$A23=\"\",LEFT('投資組合-個股別'!$A23,1)=\"M\",LEFT('投資組合-個股別'!$A23,1)=\"T\"),\"\",'投資組合-個股別'!$A23)","v":"1216"},3.07,2,5.5689000000000002,20]
[{"$f":"IF(OR('投資組合-個股別'!$A24=\"\",LEFT('投資組合-個股別'!$A24,1)=\"M\",LEFT('投資組合-個股別'!$A24,1)=\"T\"),\"\",'投資組合-個股別'!$A24)","v":"2890"},2.89,3.04,1.0419,21]
[{"$f":"IF(OR('投資組合-個股別'!$A25=\"\",LEFT('投資組合-個股別'!$A25,1)=\"M\",LEFT('投資組合-個股別'!$A25,1)=\"T\"),\"\",'投資組合-個股別'!$A25)","v":"2891"},2.87,1.37,5.3598999999999997,22]
[{"$f":"IF(OR('投資組合-個股別'!$A26=\"\",LEFT('投資組合-個股別'!$A26,1)=\"M\",LEFT('投資組合-個股別'!$A26,1)=\"T\"),\"\",'投資組合-個股別'!$A26)","v":"2886"},2.75,1.53,0.89870000000000005,23]
[{"$f":"IF(OR('投資組合-個股別'!$A27=\"\",LEFT('投資組合-個股別'!$A27,1)=\"M\",LEFT('投資組合-個股別'!$A27,1)=\"T\"),\"\",'投資組合-個股別'!$A27)","v":"2412"},2.66,0.88,1.2098,24]
[{"$f":"IF(OR('投資組合-個股別'!$A28=\"\",LEFT('投資組合-個股別'!$A28,1)=\"M\",LEFT('投資組合-個股別'!$A28,1)=\"T\"),\"\",'投資組合-個股別'!$A28)","v":"2376"},2.58,4.82,-0.95779999999999998,25]

{"sheet":"基金屬性","index":1,"n_rows":3,"n_cols":21,"rows_kept":3,"cut":false,"hidden":false,"merged":[]}
["00878 國泰永續高股息"]
["基金統編","基金全稱","基金英文全稱","現任經理人Ａ","現任經理人Ｂ","公會分類","傘狀基金","傘狀基金成員1","傘狀基金成員2","成立資產","成立日","型態","投資標的","經理費上限%","經理費下限%","保管費上限%","保管費下限%","銷售費上限%","銷售費下限%","贖回費(元)","受益人大會費用(萬元)"]
["88090913","國泰台灣高股息傘型證券投資信託基金之台灣ESG永續高股息ETF證券投資信託基金","Cathay MSCI Taiwan ESG Sustainability High Dividend Yield ETF","游日傑(2021/03/01到任)",null,"國內指數-一般ETF","Y","T3786A 國泰台灣高股息傘型證券投資信託基金之台灣高股息證券投資信託基金 A類型新臺幣",null,6769050,"2020-07-10","國內募集,投資國內","ETF",0.3,0.25,0.03,null,2,0,0,100]

{"sheet":"淨值及報酬","index":2,"n_rows":9,"n_cols":5,"rows_kept":9,"cut":false,"hidden":false,"merged":[]}
["00878 國泰永續高股息"]
["Data Field","2024-10-30",null,"Data Field","2024-09-30"]
["淨值(元)",22.75,null,"基金淨資產",323292924]
["淨值變動率%-日",-0.56818199999999996]
["近一個月變動率%",1.021315]
["近三個月變動率%",1.648911]
["近半年變動率%",7.4697930000000001]
["近一年變動率%",25.217426]
["近三年變動率%",53.820667]

{"sheet":"風險控管","index":3,"n_rows":11,"n_cols":3,"rows_kept":11,"cut":false,"hidden":false,"merged":[]}
["00878 國泰永續高股息"]
["Data Field","2024-10-30","2024-09-30"]
["年化標準差--12個月",13.2646,14.792899999999999]
["beta--12個月",0.75180000000000002,0.81610000000000005]
["Sharpe Index-12個月",0.50690000000000002,0.34749999999999998]
["IR--12個月（大分類）",-0.2014,-0.14180000000000001]
["年化標準差--24個月",15.904199999999999,16.186399999999999]
["beta--24個月",0.68410000000000004,0.68559999999999999]
["Sharpe Index-24個月",0.4672,0.43130000000000002]
["IR--24個月（大分類）",-0.15939999999999999,-9.6699999999999994E-2]
["淨值",22.75,22.52]

{"sheet":"基金PROFILE","index":4,"n_rows":6,"n_cols":11,"rows_kept":6,"cut":false,"hidden":false,"merged":[]}
["00878 "]
["年月日","近一個月變動率(同類型排名)","近一個月變動率(同類型檔數)","近三個月變動率(同類型排名)","近三個月變動率(同類型檔數)","近半年變動率(同類型排名)","近半年變動率(同類型檔數)","近一年變動率(同類型排名)","近一年變動率(同類型檔數)","近三年變動率(同類型排名)","近三年變動率(同類型檔數)"]
["2024-10-30",27,55,29,54,30,52,38,48,11,27]
[]
["年月日","近一個月變動率%","近三個月變動率%","近半年變動率%","近一年變動率%","近三年變動率%"]
["2024-10-30",1.021315,1.648911,7.4697930000000001,25.217426,53.820667]

{"sheet":"投資組合-個股別","index":5,"n_rows":41,"n_cols":4,"rows_kept":41,"cut":false,"hidden":false,"merged":[]}
["00878 國泰永續高股息"]
[null,"2024-09-30","2024-09-30","2024-09-30"]
["投資證券代碼","投資比率％","持股數/流通在外股數%","個股月報酬率％"]
["2454",4.7300000000000004,0.81,-5.2417999999999996]
["3034",4.72,4.84,-4.0740999999999996]
["2474",4.29,8.6199999999999992,0.21190000000000001]
["2303",3.88,1.86,-3.0634000000000001]
["2882",3.83,1.27,4.7244000000000002]
["3711",3.65,1.77,-1.6285000000000001]
["2881",3.61,0.94,3.2860999999999998]
["2377",3.45,7.59,-5.1772]
["2301",3.43,4.75,-7.0094000000000003]
["1402",3.4,5.35,5.9310999999999998]
["2324",3.4,7.49,0.30149999999999999]
["4904",3.38,3.34,0.221]
["2382",3.35,1.06,-1.4923]
["5347",3.34,6.37,-15.8537]
["3045",3.27,2.4700000000000002,2.6783999999999999]
["2379",3.21,4.3,-9.1692999999999998]
["3702",3.2,8.2200000000000006,-7.6353999999999997]
["2885",3.15,2.48,-0.627]
["3231",3.12,3.45,-0.49249999999999999]
["1216",3.07,2,5.5689000000000002]
["2890",2.89,3.04,1.0419]
["2891",2.87,1.37,5.3598999999999997]
["2886",2.75,1.53,0.89870000000000005]
["2412",2.66,0.88,1.2098]
["2376",2.58,4.82,-0.95779999999999998]
["1101",2.5299999999999998,3.2,2.5796999999999999]
["2356",2.5,5.23,-5.4824000000000002]
["2892",2.3199999999999998,1.95,0.55069999999999997]
["2105",2.31,4.45,4.3301999999999996]
["5876",2.1800000000000002,3.76,-4.0991999999999997]
["M1100",2.5299999999999998,null,3.2959000000000001]
["M1200",3.07,null,2.2852999999999999]
["M1400",3.4,null,0.66569999999999996]
["M2100",2.31,null,0.63880000000000003]
["M2300",62.16,null,-0.79379999999999995]
["M2800",23.6,null,1.4469000000000001]
["MOTC",3.34,null,-2.2326999999999999]
["MTSE",93.73,null,-0.19539999999999999]

{"sheet":"投資組合-產品別","index":6,"n_rows":84,"n_cols":7,"rows_kept":84,"cut":false,"hidden":false,"merged":[]}
["00878 國泰永續高股息"]
["Data Field","2024-10-25","2024-10-18","2024-10-11","2024-10-04","2024-09-27","較上月比*"]
["M2800 金融保險",23.39,23.71,23.43,23.55,23.44,{"$f":"B3-F3","v":-5.0000000000000711E-2}]
["M2325 電腦及週邊設備業",23.16,22.71,22.48,21.92,21.95,1.2100000000000009]
["M2324 半導體業",20.28,20.21,20.53,20.5,20.61,-0.32999999999999829]
["M2327 通訊網路業",8.9,8.9600000000000009,8.98,9.15,9.27,-0.36999999999999922]
["M2331 其他電子業",4.2,4.32,4.29,4.26,4.21,-9.9999999999997868E-3]
["M1400 紡織纖維",3.27,3.2,3.21,3.33,3.34,-6.999999999999984E-2]
["M2329 電子通路業",3.22,3.24,3.23,3.2,3.26,-3.9999999999999591E-2]
["O2324 OTC 半導體業",3.2,3.27,3.27,3.24,3.28,-7.9999999999999627E-2]
["M1200 食品工業",3.05,3.07,3.03,3.08,3.08,-3.0000000000000249E-2]
["M1100 水泥工業",2.34,2.39,2.42,2.54,2.46,-0.12000000000000011]
["M2100 橡膠工業",2.0299999999999998,2.0699999999999998,2.16,2.34,2.17,-0.14000000000000012]
["ZCC   存放金融機",1.66,1.27,1.51,1.77,1.43,0.22999999999999998]
["ZBB   附條件債券",0.44,0.44,0.45,0.45,0.45,-1.0000000000000009E-2]
["M0000 特殊",0,0,0,0,0,0]
["M1300 塑膠工業",0,0,0,0,0,0]
["M1500 電機機械",0,0,0,0,0,0]
["M1600 電器電纜",0,0,0,0,0,0]
["M1721 化學工業",0,0,0,0,0,0]
["M1722 生技醫療業",0,0,0,0,0,0]
["M1800 玻璃陶瓷",0,0,0,0,0,0]
["M1900 造紙工業",0,0,0,0,0,0]
["M2000 鋼鐵工業",0,0,0,0,0,0]
["M2200 汽車工業",0,0,0,0,0,0]
["M2326 光電業",0,0,0,0,0,0]
["M2328 電子零組件",0,0,0,0,0,0]
["M2330 資訊服務業",0,0,0,0,0,0]
["M2500 建材營造",0,0,0,0,0,0]
["M2600 航運業",0,0,0,0,0,0]
["M2700 觀光事業",0,0,0,0,0,0]
["M2900 貿易百貨",0,0,0,0,0,0]
["M9700 油電燃氣業",0,0,0,0,0,0]
["M9800 綜合產業",0,0,0,0,0,0]
["M9900 其他",0,0,0,0,0,{"$f":"B35-F35","v":0}]
["MUUUU 承銷",0,0,0,0,0,0]
["MWWWW 認購權證",0,0,0,0,0,0]
["OTC00 OTC 特殊",0,0,0,0,0,0]
["OTC12 OTC 食品類",0,0,0,0,0,0]
["OTC13 OTC 塑膠類",0,0,0,0,0,0]
["OTC14 OTC 紡織",0,0,0,0,0,0]
["OTC15 OTC 電機",0,0,0,0,0,0]
["OTC16 OTC 電纜類",0,0,0,0,0,0]
["O1721 OTC 化學工業",0,0,0,0,0,0]
["O1722 OTC 生技醫療",0,0,0,0,0,0]
["OTC18 OTC 玻璃",0,0,0,0,0,0]
["OTC20 OTC 鋼鐵類",0,0,0,0,0,0]
["OTC21 OTC 橡膠類",0,0,0,0,0,0]
["O2325 OTC 電腦及週邊設備業",0,0,0,0,0,0]
["O2326 OTC 光電業",0,0,0,0,0,0]
["O2327 OTC 通訊網路業",0,0,0,0,0,0]
["O2328 OTC 電子零組件",0,0,0,0,0,0]
["O2329 OTC 電子通路業",0,0,0,0,0,0]
["O2330 OTC 資訊服務業",0,0,0,0,0,0]
["O2331 OTC 其他電子業",0,0,0,0,0,0]
["OTC25 OTC 營造",0,0,0,0,0,0]
["OTC26 OTC 運輸類",0,0,0,0,0,0]
["OTC27 OTC 觀光類",0,0,0,0,0,0]
["OTC28 OTC 金融類",0,0,0,0,0,0]
["OTC29 OTC 百貨類",0,0,0,0,0,0]
["OTC30 OTC 證券類",0,0,0,0,0,0]
["OTC89 OTC 其它類",0,0,0,0,0,0]
["OTC97 OTC 油電燃氣業",0,0,0,0,0,0]
["F0002 日本",0,0,0,0,0,0]
["F0003 歐洲",0,0,0,0,0,0]
["F0004 紐澳",0,0,0,0,0,0]
["F0006 海外其他",0,0,0,0,0,{"$f":"B67-F67","v":0}]
["F0007 北美",0,0,0,0,0,0]
["F0008 已開發歐洲",0,0,0,0,0,0]
["F0009 亞不含日本",0,0,0,0,0,0]
["F0010 新興歐洲",0,0,0,0,0,0]
["F0011 新興拉美",0,0,0,0,0,0]
["ZAA   買斷債券",0,0,0,0,0,0]
["ZDD   短期票券",0,0,0,0,0,0]
["ZEE   其他投資",0,0,0,0,0,0]
["F0001 美國",null,null,null,null,null,0]
["F0005 東南亞",null,null,null,null,null,0]
[]
["* 實為較4週前比較，持股率的增減"]
[]
["Data Field","2024-10-25","2024-10-18","2024-10-11","2024-10-04","2024-09-27","較上月比*"]
["TT99F 國外合計",0,0,0,0,0,{"$f":"B82-F82","v":0}]
["TT99L 國內合計",97.04,97.15,97.03,97.11,97.07,{"$f":"B83-F83","v":-2.9999999999986926E-2}]
["現金部位估計",{"$f":"100-B82-B83","v":2.9599999999999937},{"$f":"100-C82-C83","v":2.8499999999999943},{"$f":"100-D82-D83","v":2.9699999999999989},{"$f":"100-E82-E83","v":2.8900000000000006},{"$f":"100-F82-F83","v":2.9300000000000068},{"$f":"B84-F84","v":2.9999999999986926E-2}]

{"sheet":"圖型","index":7,"n_rows":705,"n_cols":21,"rows_kept":705,"cut":false,"hidden":false,"merged":[[0,13,0,14],[0,16,0,17],[0,19,0,20]]}
["00878 國泰永續高股息",null,null,null,null,null,"Y9999 加權指數",null,null,null,null,null,{"$f":"MATCH($L$2,M3:M705,0)","v":250},"近一月報酬率",null,null,"近三月報酬率",null,null,"近一年報酬率"]
["年月日","淨值(元)","近一個月變動率%","近三個月變動率%","近一年變動率%",null,"年月日","淨值(元)","近一個月變動率%","近三個月變動率%","近一年變動率%",{"$f":"MIN(M3:M705)","v":"2023-10-20"},null,{"$f":"MID($A$1,FIND(\" \",$A$1)+1,12)","v":"國泰永續高股息"},"加權指數",null,{"$f":"MID($A$1,FIND(\" \",$A$1)+1,12)","v":"國泰永續高股息"},"加權指數",null,{"$f":"MID($A$1,FIND(\" \",$A$1)+1,12)","v":"國泰永續高股息"},"加權指數"]
["2024-10-30",22.75,1.021315,1.648911,25.217426,null,"2024-11-01",22780.080000000002,1.7403999999999999,0.60960000000000003,42.034599999999998,{"$f":"OFFSET(圖型!M2,圖型!$M$1,2,)","v":""},{"$f":"IF($A3=\"\",\"\",$A3)","v":"2024-10-30"},{"$f":"IF(ISERROR(VLOOKUP($M3,XX_TEJ6,3,FALSE)=TRUE),\"\",VLOOKUP($M3,XX_TEJ6,3,FALSE))","v":1.021315},{"$f":"IF(ISERROR(VLOOKUP($M3,XX_TEJ7,3,FALSE)=TRUE),\"\",VLOOKUP($M3,XX_TEJ7,3,FALSE))","v":2.6812},null,{"$f":"IF(ISERROR(VLOOKUP($M3,XX_TEJ6,4,FALSE)=TRUE),\"\",VLOOKUP($M3,XX_TEJ6,4,FALSE))","v":1.648911},{"$f":"IF(ISERROR(VLOOKUP($M3,XX_TEJ7,4,FALSE)=TRUE),\"\",VLOOKUP($M3,XX_TEJ7,4,FALSE))","v":2.6858},null,{"$f":"IF(ISERROR(VLOOKUP($M3,XX_TEJ6,5,FALSE)=TRUE),\"\",VLOOKUP($M3,XX_TEJ6,5,FALSE))","v":25.217426},{"$f":"IF(ISERROR(VLOOKUP($M3,XX_TEJ7,5,FALSE)=TRUE),\"\",VLOOKUP($M3,XX_TEJ7,5,FALSE))","v":41.307000000000002}]
["2024-10-29",22.88,0.17513200000000001,2.4979640000000001,25.869094,null,"2024-10-30",22820.43,2.6812,2.6858,41.307000000000002,"=OFFSET(圖型!P2,圖型!$P$1,2,)",{"$f":"IF($A4=\"\",\"\",$A4)","v":"2024-10-29"},0.17513200000000001,0.45469999999999999,null,2.4979640000000001,3.4384999999999999,null,25.869094,42.096899999999998]
["2024-10-28",23.05,0.91944000000000004,2.4976340000000001,26.804310000000001,null,"2024-10-29",22926.59,0.45469999999999999,3.4384999999999999,42.096899999999998,"=OFFSET(圖型!S2,圖型!$S$1,2,)","2024-10-28",0.91944000000000004,1.6442000000000001,null,2.4976340000000001,4.8776000000000002,null,26.804310000000001,43.779600000000002]
["2024-10-25",23.09,1.0503279999999999,0.70853999999999995,26.065446000000001,null,"2024-10-28",23198.07,1.6442000000000001,4.8776000000000002,43.779600000000002,null,"2024-10-25",1.0503279999999999,2.5781999999999998,null,0.70853999999999995,2.0840999999999998,null,26.065446000000001,42.727699999999999]
["2024-10-24",22.87,0.83774199999999999,-0.25100499999999998,25.05311,null,"2024-10-25",23348.45,2.5781999999999998,2.0840999999999998,42.727699999999999,null,"2024-10-24",0.83774199999999999,3.3913000000000002,null,-0.25100499999999998,1.4023000000000001,null,25.05311,42.201500000000003]
["2024-10-23",22.98,1.771479,0.228767,27.258144000000001,null,"2024-10-24",23192.52,3.3913000000000002,1.4023000000000001,42.201500000000003,null,"2024-10-23",1.771479,4.7081,null,0.228767,2.0243000000000002,null,27.258144000000001,43.587899999999998]
["2024-10-22",23.22,3.7070120000000002,3.1640290000000002,27.159185999999998,null,"2024-10-23",23334.76,4.7081,2.0243000000000002,43.587899999999998,null,"2024-10-22",3.7070120000000002,6.2096,null,3.1640290000000002,5.7443,null,27.159185999999998,43.154600000000002]
["2024-10-21",23.1,3.1710579999999999,0.49546200000000001,26.502032,null,"2024-10-22",23535.43,6.2096,5.7443,43.154600000000002,null,"2024-10-21",3.1710579999999999,6.2416999999999998,null,0.49546200000000001,2.9443000000000001,null,26.502032,43.197899999999997]
["2024-10-18",23.15,4.8460150000000004,-0.92770300000000006,25.258330000000001,null,"2024-10-21",23542.53,6.2416999999999998,2.9443000000000001,43.197899999999997,null,"2024-10-18",4.8460150000000004,8.3420000000000005,null,-0.92770300000000006,0.37980000000000003,null,25.258330000000001,42.860100000000003]
["2024-10-17",23.04,3.3647369999999999,-2.13429,23.188572000000001,null,"2024-10-18",23487.27,8.3420000000000005,0.37980000000000003,42.860100000000003,null,"2024-10-17",3.3647369999999999,5.5091999999999999,null,-2.13429,-3.0118999999999998,null,23.188572000000001,38.524799999999999]
["2024-10-16",22.84,2.467473,-3.702458,21.10455,null,"2024-10-17",23053.84,5.5091999999999999,-3.0118999999999998,38.524799999999999,null,"2024-10-16",2.467473,5.3129999999999997,null,-3.702458,-4.1097000000000001,null,21.10455,38.186700000000002]
["2024-10-15",23.01,3.3228550000000001,-3.1053310000000001,21.294536999999998,null,"2024-10-16",23010.98,5.3129999999999997,-4.1097000000000001,38.186700000000002,null,"2024-10-15",3.3228550000000001,7.0423999999999998,null,-3.1053310000000001,-2.4592999999999998,null,21.294536999999998,38.7883]
["2024-10-14",22.77,2.2451720000000002,-4.3126110000000004,20.029405000000001,null,"2024-10-15",23292.04,7.0423999999999998,-2.4592999999999998,38.7883,null,"2024-10-14",2.2451720000000002,5.5867000000000004,null,-4.3126110000000004,-3.9369999999999998,null,20.029405000000001,36.900799999999997]
["2024-10-11",22.66,3.3759109999999999,-5.5880970000000003,18.871943000000002,null,"2024-10-14",22975.29,5.5867000000000004,-3.9369999999999998,36.900799999999997,null,"2024-10-11",3.3759109999999999,8.8947000000000003,null,-5.5880970000000003,-6.1022999999999996,null,18.871943000000002,37.366799999999998]
["2024-10-09",22.53,2.0380419999999999,-5.0875899999999996,17.961811999999998,null,"2024-10-11",22901.64,8.8947000000000003,-6.1022999999999996,37.366799999999998,null,"2024-10-09",2.0380419999999999,7.1632999999999996,null,-5.0875899999999996,-5.1921999999999997,null,17.961811999999998,37.157899999999998]
["2024-10-08",22.49,0.76164699999999996,-5.2950400000000002,17.752381,null,"2024-10-09",22659.08,7.1632999999999996,-5.1921999999999997,37.157899999999998,null,"2024-10-08",0.76164699999999996,5.4871999999999996,null,-5.2950400000000002,-5.3048999999999999,null,17.752381,36.869199999999999]
["2024-10-07",22.65,1.4784930000000001,-4.2276439999999997,18.590104,null,"2024-10-08",22611.39,5.4871999999999996,-5.3048999999999999,36.869199999999999,null,"2024-10-07",1.4784930000000001,5.9126000000000003,null,-4.2276439999999997,-3.6252,null,18.590104,37.421100000000003]
["2024-10-04",22.45,2.4178820000000001,-4.916347,19.386761,null,"2024-10-07",22702.560000000001,5.9126000000000003,-3.6252,37.421100000000003,null,"2024-10-04",2.4178820000000001,5.7363999999999997,null,-4.916347,-5.1855000000000002,null,19.386761,37.051499999999997]
["2024-10-01",22.67,-0.87450799999999995,-2.9819010000000001,20.912324000000002,null,"2024-10-04",22302.71,5.7363999999999997,-5.1855000000000002,37.051499999999997,null,"2024-10-01",-0.87450799999999995,0.54930000000000001,null,-2.9819010000000001,-2.8976000000000002,null,20.912324000000002,36.914099999999998]
["2024-09-30",22.52,-1.5303899999999999,-2.5244909999999998,20.112286000000001,null,"2024-10-01",22390.39,0.54930000000000001,-2.8976000000000002,36.914099999999998,null,"2024-09-30",-1.5303899999999999,-0.19539999999999999,null,-2.5244909999999998,-3.5066000000000002,null,20.112286000000001,35.900100000000002]
["2024-09-27",22.84,-0.13117699999999999,-0.593445,22.059069000000001,null,"2024-09-30",22224.54,-0.19539999999999999,-3.5066000000000002,35.900100000000002,null,"2024-09-27",-0.13117699999999999,2.8751000000000002,null,-0.593445,-0.36280000000000001,null,22.059069000000001,39.929499999999997]
["2024-09-26",22.93,0.218531,-0.62389700000000003,23.024864999999998,null,"2024-09-27",22822.79,2.8751000000000002,-0.36280000000000001,39.929499999999997,null,"2024-09-26",0.218531,2.7822,null,-0.62389700000000003,-0.55589999999999995,null,23.024864999999998,40.445700000000002]
["2024-09-25",22.85,0.48372900000000002,-1.1378870000000001,21.573515,null,"2024-09-26",22858.81,2.7822,-0.55589999999999995,40.445700000000002,null,"2024-09-25",0.48372900000000002,2.7242000000000002,null,-1.1378870000000001,-0.49959999999999999,null,21.573515,38.350999999999999]
["2024-09-24",22.68,-0.26385199999999998,-2.2037960000000001,21.084720000000001,null,"2024-09-25",22761.599999999999,2.7242000000000002,-0.49959999999999999,38.350999999999999,null,"2024-09-24",-0.26385199999999998,1.2357,null,-2.2037960000000001,-1.6737,null,21.084720000000001,37.245100000000001]
["2024-09-23",22.58,-0.70360599999999995,-3.3670640000000001,20.550837000000001,null,"2024-09-24",22431.78,1.2357,-1.6737,37.245100000000001,null,"2024-09-23",-0.70360599999999995,0.5756,null,-3.3670640000000001,-4.1619000000000002,null,20.550837000000001,36.350299999999997]
["2024-09-20",22.39,-2.2270750000000001,-4.776821,19.301614000000001,null,"2024-09-23",22285.53,0.5756,-4.1619000000000002,36.350299999999997,null,"2024-09-20",-2.2270750000000001,-1.2020999999999999,null,-4.776821,-5.3258999999999999,null,19.301614000000001,34.018500000000003]
["2024-09-19",22.32,-2.5752950000000001,-4.5196389999999997,18.695436999999998,null,"2024-09-20",22159.42,-1.2020999999999999,-5.3258999999999999,34.018500000000003,null,"2024-09-19",-2.5752950000000001,-1.6372,null,-4.5196389999999997,-5.0270999999999999,null,18.695436999999998,32.498600000000003]
["2024-09-18",22.08,-3.2427700000000002,-4.1048799999999996,16.675619999999999,null,"2024-09-19",22042.69,-1.6372,-5.0270999999999999,32.498600000000003,null,"2024-09-18",-3.2427700000000002,-2.9998,null,-4.1048799999999996,-4.7392000000000003,null,16.675619999999999,29.828299999999999]
["2024-09-16",22.29,-2.322524,-2.490135,16.256363,null,"2024-09-18",21678.84,-2.9998,-4.7392000000000003,29.828299999999999,null,"2024-09-16",-2.322524,-2.2336,null,-2.490135,-2.9087000000000001,null,16.256363,29.131799999999998]
["2024-09-13",22.27,-0.66904600000000003,-2.243703,18.197780999999999,null,"2024-09-16",21850.080000000002,-2.2336,-2.9087000000000001,29.131799999999998,null,"2024-09-13",-0.66904600000000003,-0.16919999999999999,null,-2.243703,-2.4754999999999998,null,18.197780999999999,31.229700000000001]
["2024-09-12",22.25,-0.54175700000000004,-0.93077399999999999,18.323181999999999,null,"2024-09-13",21759.65,-0.16919999999999999,-2.4754999999999998,31.229700000000001,null,"2024-09-12",-0.54175700000000004,-0.55100000000000005,null,-0.93077399999999999,-1.7944,null,18.323181999999999,30.657299999999999]
["2024-09-11",21.92,-0.49741299999999999,-1.9741,16.454105999999999,null,"2024-09-12",21653.25,-0.55100000000000005,-1.7944,30.657299999999999,null,"2024-09-11",-0.49741299999999999,-2.04,null,-1.9741,-3.4923000000000002,null,16.454105999999999,27.981999999999999]
["2024-09-10",21.93,-0.452019,-2.3555890000000002,13.995099,null,"2024-09-11",21031,-2.04,-3.4923000000000002,27.981999999999999,null,"2024-09-10",-0.452019,-1.8858999999999999,null,-2.3555890000000002,-3.6335999999999999,null,13.995099,27.076899999999998]
["2024-09-09",22.08,0.228884,-1.6877059999999999,14.774819000000001,null,"2024-09-10",21064.080000000002,-1.8858999999999999,-3.6335999999999999,27.076899999999998,null,"2024-09-09",0.228884,-1.5116000000000001,null,-1.6877059999999999,-3.2658999999999998,null,14.774819000000001,27.561699999999998]
["2024-09-06",22.32,4.8970029999999998,-0.66226499999999999,15.030257000000001,null,"2024-09-09",21144.44,-1.5116000000000001,-3.2658999999999998,27.561699999999998,null,"2024-09-06",4.8970029999999998,4.5568999999999997,null,-0.66226499999999999,-2.1341000000000001,null,15.030257000000001,28.062999999999999]
["2024-09-05",22,5.7705149999999996,-1.1850210000000001,13.705178,null,"2024-09-06",21435.19,4.5568999999999997,-2.1341000000000001,28.062999999999999,null,"2024-09-05",5.7705149999999996,6.8422999999999998,null,-1.1850210000000001,-1.3828,null,13.705178,26.1816]
["2024-09-04",21.92,-1.2412749999999999,-2.18757,13.453858,null,"2024-09-05",21187.71,6.8422999999999998,-1.3828,26.1816,null,"2024-09-04",-1.2412749999999999,-2.5200999999999998,null,-2.18757,-1.2351000000000001,null,13.453858,25.630400000000002]
["2024-09-03",22.69,2.2278959999999999,7.1559999999999999E-2,18.342614000000001,null,"2024-09-04",21092.75,-2.5200999999999998,-1.2351000000000001,25.630400000000002,null,"2024-09-03",2.2278959999999999,2.0989,null,7.1559999999999999E-2,2.5794999999999999,null,18.342614000000001,32.727400000000003]
["2024-09-02",22.87,3.0388700000000002,1.9627460000000001,19.281427000000001,null,"2024-09-03",22092.21,2.0989,2.5794999999999999,32.727400000000003,null,"2024-09-02",3.0388700000000002,2.7591999999999999,null,1.9627460000000001,5.0106999999999999,null,19.281427000000001,33.585900000000002]
["2024-08-30",22.87,2.1850809999999998,1.4330689999999999,18.145413000000001,null,"2024-09-02",22235.1,2.7591999999999999,5.0106999999999999,33.585900000000002,null,"2024-08-30",2.1850809999999998,0.20030000000000001,null,1.4330689999999999,4.2298999999999998,null,18.145413000000001,33.184899999999999]
["2024-08-29",22.85,2.3635700000000002,0.56077500000000002,18.380324000000002,null,"2024-08-30",22268.09,0.20030000000000001,4.2298999999999998,33.184899999999999,null,"2024-08-29",2.3635700000000002,0.1686,null,0.56077500000000002,2.4902000000000002,null,18.380324000000002,33.556800000000003]
["2024-08-28",22.89,1.786154,-0.58698700000000004,19.385739999999998,null,"2024-08-29",22201.85,0.1686,2.4902000000000002,33.556800000000003,null,"2024-08-28",1.786154,1.1368,null,-0.58698700000000004,2.3439000000000001,null,19.385739999999998,35.504800000000003]
["2024-08-27",22.87,1.697219,-0.67384900000000003,18.82441,null,"2024-08-28",22370.66,1.1368,2.3439000000000001,35.504800000000003,null,"2024-08-27",1.697219,0.2974,null,-0.67384900000000003,1.7487999999999999,null,18.82441,34.605800000000002]
["2024-08-26",22.88,1.7416860000000001,1.2582469999999999,18.876366000000001,null,"2024-08-27",22185,0.2974,1.7487999999999999,34.605800000000002,null,"2024-08-26",1.7416860000000001,0.54659999999999997,null,1.2582469999999999,3.1293000000000002,null,18.876366000000001,34.940100000000001]
["2024-08-23",22.74,-0.81800799999999996,0.29207899999999998,15.764927999999999,null,"2024-08-26",22240.12,0.54659999999999997,3.1293000000000002,34.940100000000001,null,"2024-08-23",-0.81800799999999996,-3.1208999999999998,null,0.29207899999999998,2.5486,null,15.764927999999999,33.668999999999997]
["2024-08-22",22.72,0.94258200000000003,0.203872,16.814261999999999,null,"2024-08-23",22158.05,-3.1208999999999998,2.5486,33.668999999999997,null,"2024-08-22",0.94258200000000003,-0.48599999999999999,null,0.203872,2.7704,null,16.814261999999999,34.745699999999999]
["2024-08-21",22.75,-1.0271950000000001,2.004794,17.413677,null,"2024-08-22",22148.83,-0.48599999999999999,2.7704,34.745699999999999,null,"2024-08-21",-1.0271950000000001,-2.7608000000000001,null,2.004794,4.7145999999999999,null,17.413677,35.750999999999998]
["2024-08-20",22.9,-0.37462699999999999,2.0520890000000001,18.187833000000001,null,"2024-08-21",22237.89,-2.7608000000000001,4.7145999999999999,35.750999999999998,null,"2024-08-20",-0.37462699999999999,-1.9247000000000001,null,2.0520890000000001,5.4417,null,18.187833000000001,36.919699999999999]
["2024-08-19",22.91,-0.331123,2.3638050000000002,18.239443000000001,null,"2024-08-20",22429.1,-1.9247000000000001,5.4417,36.919699999999999,null,"2024-08-19",-0.331123,-2.0099,null,2.3638050000000002,5.4154,null,18.239443000000001,36.800800000000002]
["2024-08-16",22.82,-3.7867799999999998,1.872822,16.226734,null,"2024-08-19",22409.63,-2.0099,5.4154,36.800800000000002,null,"2024-08-16",-3.7867799999999998,-6.8670999999999998,null,1.872822,4.9058000000000002,null,16.226734,35.889600000000002]
["2024-08-15",22.97,-5.5898079999999997,0.68801199999999996,16.097155999999998,null,"2024-08-16",22349.33,-6.8670999999999998,4.9058000000000002,35.889600000000002,null,"2024-08-15",-5.5898079999999997,-8.3092000000000006,null,0.68801199999999996,3.5373999999999999,null,16.097155999999998,33.063499999999998]
["2024-08-14",23.25,-4.6349479999999996,1.9153800000000001,19.134374999999999,null,"2024-08-15",21895.17,-8.3092000000000006,3.5373999999999999,33.063499999999998,null,"2024-08-14",-4.6349479999999996,-7.9009999999999998,null,1.9153800000000001,4.9627999999999997,null,19.134374999999999,34.365299999999998]
["2024-08-13",22.97,-5.7834300000000001,1.471239,16.920539000000002,null,"2024-08-14",22027.25,-7.9009999999999998,4.9627999999999997,34.365299999999998,null,"2024-08-13",-5.7834300000000001,-8.8655000000000008,null,1.471239,4.5018000000000002,null,16.920539000000002,31.2957]
["2024-08-12",22.92,-5.9885159999999997,1.294135,16.666032000000001,null,"2024-08-13",21796.57,-8.8655000000000008,4.5018000000000002,31.2957,null,"2024-08-12",-5.9885159999999997,-8.9629999999999992,null,1.294135,5.1403999999999996,null,16.666032000000001,31.155200000000001]
["2024-08-09",22.57,-7.1957240000000002,1.3688739999999999,12.647511,null,"2024-08-12",21773.26,-8.9629999999999992,5.1403999999999996,31.155200000000001,null,"2024-08-09",-7.1957240000000002,-10.171799999999999,null,1.3688739999999999,4.4179000000000004,null,12.647511,27.255099999999999]
["2024-08-08",22,-9.5766550000000006,-1.580354,9.2455079999999992,null,"2024-08-09",21469,-10.171799999999999,4.4179000000000004,27.255099999999999,null,"2024-08-08",-9.5766550000000006,-12.5975,null,-1.580354,0.81969999999999998,null,9.2455079999999992,23.660299999999999]
["2024-08-07",22.33,-7.8415179999999998,0.29096100000000003,10.476528999999999,null,"2024-08-08",20870.099999999999,-12.5975,0.81969999999999998,23.660299999999999,null,"2024-08-07",-7.8415179999999998,-9.5995000000000008,null,0.29096100000000003,3.1076999999999999,null,10.476528999999999,25.296600000000002]
["2024-08-06",21.8,-10.028890000000001,-1.265198,11.017564999999999,null,"2024-08-07",21295.279999999999,-9.5995000000000008,3.1076999999999999,25.296600000000002,null,"2024-08-06",-10.028890000000001,-12.9711,null,-1.265198,-0.1081,null,11.017564999999999,21.714200000000002]
["2024-08-05",21.31,-12.051176,-2.0523570000000002,8.5222160000000002,null,"2024-08-06",20501.02,-12.9711,-0.1081,21.714200000000002,null,"2024-08-05",-12.051176,-15.816000000000001,null,-2.0523570000000002,-2.4561000000000002,null,8.5222160000000002,17.735499999999998]
["2024-08-02",22.74,-4.8535560000000002,4.6615640000000003,15.476811,null,"2024-08-05",19830.88,-15.816000000000001,-2.4561000000000002,17.735499999999998,null,"2024-08-02",-4.8535560000000002,-5.4253,null,4.6615640000000003,7.0010000000000003,null,15.476811,28.084299999999999]
["2024-08-01",23.3,-2.6733500000000001,7.4324659999999998,14.121748,null,"2024-08-02",21638.09,-5.4253,7.0010000000000003,28.084299999999999,null,"2024-08-01",-2.6733500000000001,-1.8061,null,7.4324659999999998,11.0098,null,14.121748,31.5425]
["2024-07-31",22.89,-3.2953109999999999,5.5420239999999996,12.317997,null,"2024-08-01",22642.1,-1.8061,11.0098,31.5425,null,"2024-07-31",-3.2953109999999999,-3.6162000000000001,null,5.5420239999999996,8.8391999999999999,null,12.317997,29.477499999999999]
["2024-07-30",22.93,-3.1263200000000002,5.7264569999999999,9.0354729999999996,null,"2024-07-31",22199.35,-3.6162000000000001,8.8391999999999999,29.477499999999999,null,"2024-07-30",-3.1263200000000002,-3.5110000000000001,null,5.7264569999999999,8.9579000000000004,null,9.0354729999999996,28.513300000000001]
["2024-07-29",22.87,-3.3798050000000002,4.9291850000000004,8.7501639999999998,null,"2024-07-30",22223.57,-3.5110000000000001,8.9579000000000004,28.513300000000001,null,"2024-07-29",-3.3798050000000002,-3.7675000000000001,null,4.9291850000000004,8.1438000000000006,null,8.7501639999999998,28.171600000000002]
["2024-07-26",23.04,-2.5380720000000001,8.1359049999999993,11.179083,null,"2024-07-29",22164.49,-3.7675000000000001,8.1438000000000006,28.171600000000002,null,"2024-07-26",{"$f":"IF(ISERROR(VLOOKUP($M67,XX_TEJ6,3,FALSE)=TRUE),\"\",VLOOKUP($M67,XX_TEJ6,3,FALSE))","v":-2.5380720000000001},{"$f":"IF(ISERROR(VLOOKUP($M67,XX_TEJ7,3,FALSE)=TRUE),\"\",VLOOKUP($M67,XX_TEJ7,3,FALSE))","v":-3.7736999999999998},null,{"$f":"IF(ISERROR(VLOOKUP($M67,XX_TEJ6,4,FALSE)=TRUE),\"\",VLOOKUP($M67,XX_TEJ6,4,FALSE))","v":8.1359049999999993},{"$f":"IF(ISERROR(VLOOKUP($M67,XX_TEJ7,4,FALSE)=TRUE),\"\",VLOOKUP($M67,XX_TEJ7,4,FALSE))","v":9.9343000000000004},null,{"$f":"IF(ISERROR(VLOOKUP($M67,XX_TEJ6,5,FALSE)=TRUE),\"\",VLOOKUP($M67,XX_TEJ6,5,FALSE))","v":11.179083},{"$f":"IF(ISERROR(VLOOKUP($M67,XX_TEJ7,5,FALSE)=TRUE),\"\",VLOOKUP($M67,XX_TEJ7,5,FALSE))","v":28.881399999999999}]
["2024-07-23",23.49,-1.8796999999999999,11.321281000000001,16.269000999999999,null,"2024-07-26",22119.21,-3.7736999999999998,9.9343000000000004,28.881399999999999,null,{"$f":"IF($A68=\"\",\"\",$A68)","v":"2024-07-23"},-1.8796999999999999,-1.6408,null,11.321281000000001,16.698,null,16.269000999999999,34.298400000000001]
["2024-07-22",23.06,-3.6758570000000002,9.5883059999999993,14.14062,null,"2024-07-23",22871.84,-1.6408,16.698,34.298400000000001,null,"2024-07-22",-3.6758570000000002,-4.2849000000000004,null,9.5883059999999993,14.661099999999999,null,14.14062,30.688199999999998]
["2024-07-19",23.55,-1.670147,11.399044,20.156879,null,"2024-07-22",22256.99,-4.2849000000000004,14.661099999999999,30.688199999999998,null,"2024-07-19",-1.670147,-1.466,null,11.399044,17.116099999999999,null,20.156879,33.610700000000001]
["2024-07-18",23.94,1.4836780000000001,10.582921000000001,19.651634000000001,null,"2024-07-19",22869.26,-1.466,17.116099999999999,33.610700000000001,null,"2024-07-18",1.4836780000000001,2.8169,null,10.582921000000001,15.257300000000001,null,19.651634000000001,35.817999999999998]
["2024-07-17",24.12,3.2976429999999999,11.616116999999999,21.396650999999999,null,"2024-07-18",23398.47,2.8169,15.257300000000001,35.817999999999998,null,"2024-07-17",3.2976429999999999,5.66,null,11.616116999999999,17.595500000000001,null,21.396650999999999,37.126899999999999]
["2024-07-16",24.3,3.7574709999999998,13.476475000000001,23.924800999999999,null,"2024-07-17",23769.82,5.66,17.595500000000001,37.126899999999999,null,"2024-07-16",3.7574709999999998,6.6321000000000003,null,13.476475000000001,20.577999999999999,null,23.924800999999999,38.843899999999998]
["2024-07-15",24.33,3.885567,10.536298,24.077794999999998,null,"2024-07-16",23997.25,6.6321000000000003,20.577999999999999,38.843899999999998,null,"2024-07-15",3.885567,6.1082999999999998,null,10.536298,16.7714,null,24.077794999999998,38.161799999999999]
["2024-07-12",24.38,5.953932,9.4981469999999995,29.293845999999998,null,"2024-07-15",23879.360000000001,6.1082999999999998,16.7714,38.161799999999999,null,"2024-07-12",5.953932,8.4719999999999995,null,9.4981469999999995,15.3376,null,29.293845999999998,41.003500000000003]
["2024-07-11",24.59,7.3330419999999998,9.7661350000000002,32.961976999999997,null,"2024-07-12",23916.93,8.4719999999999995,15.3376,41.003500000000003,null,"2024-07-11",7.3330419999999998,11.9214,null,9.7661350000000002,17.524699999999999,null,32.961976999999997,44.329700000000003]
["2024-07-10",24.36,5.8670140000000002,9.0251040000000007,35.390394999999998,null,"2024-07-11",24390.03,11.9214,17.524699999999999,44.329700000000003,null,"2024-07-10",5.8670140000000002,9.8301999999999996,null,9.0251040000000007,15.6219,null,35.390394999999998,44.162999999999997]
["2024-07-09",24.32,5.6931760000000002,8.8460800000000006,35.168078999999999,null,"2024-07-10",24007.08,9.8301999999999996,15.6219,44.162999999999997,null,"2024-07-09",5.6931760000000002,9.3407,null,8.8460800000000006,14.925700000000001,null,35.168078999999999,43.422199999999997]
["2024-07-08",24.33,5.7366359999999998,9.1297370000000004,35.223658999999998,null,"2024-07-09",23900.080000000002,9.3407,14.925700000000001,43.422199999999997,null,"2024-07-08",5.7366359999999998,9.2403999999999993,null,9.1297370000000004,16.948799999999999,null,35.223658999999998,43.290599999999998]
["2024-07-05",24.23,6.225339,9.2564829999999994,32.009950000000003,null,"2024-07-08",23878.15,9.2403999999999993,16.948799999999999,43.290599999999998,null,"2024-07-05",6.225339,9.6427999999999994,null,9.2564829999999994,15.8283,null,32.009950000000003,38.110300000000002]
["2024-07-04",24.19,5.3571419999999996,9.076117,31.128415,null,"2024-07-05",23556.59,9.6427999999999994,15.8283,38.110300000000002,null,"2024-07-04",5.3571419999999996,10.1418,null,9.076117,15.6609,null,31.128415,37.232100000000003]
["2024-07-03",24.05,3.5299170000000002,8.4448360000000005,32.233831000000002,null,"2024-07-04",23522.53,10.1418,15.6609,37.232100000000003,null,"2024-07-03",3.5299170000000002,7.5949999999999998,null,8.4448360000000005,13.939500000000001,null,32.233831000000002,35.637300000000003]
["2024-07-02",23.9,4.0034809999999998,7.2010139999999998,33.246501000000002,null,"2024-07-03",23172.43,7.5949999999999998,13.939500000000001,35.637300000000003,null,"2024-07-02",4.0034809999999998,8.0532000000000004,null,7.2010139999999998,11.7896,null,33.246501000000002,35.257199999999997]
["2024-07-01",23.94,4.1775450000000003,8.0918720000000004,33.469507,null,"2024-07-02",22879.37,8.0532000000000004,11.7896,35.257199999999997,null,"2024-07-01",4.1775450000000003,8.8995999999999995,null,8.0918720000000004,14.026,null,33.469507,36.316600000000001]
["2024-06-28",23.67,0.33912599999999998,6.5433729999999999,32.997335999999997,null,"2024-07-01",23058.57,8.8995999999999995,14.026,36.316600000000001,null,"2024-06-28",0.33912599999999998,5.3704999999999998,null,6.5433729999999999,14.324199999999999,null,32.997335999999997,35.999600000000001]
["2024-06-27",23.54,-0.211955,6.051615,32.682389000000001,null,"2024-06-28",23032.25,5.3704999999999998,14.324199999999999,35.999600000000001,null,"2024-06-27",-0.211955,5.0553999999999997,null,6.051615,13.395799999999999,null,32.682389000000001,35.636200000000002]
["2024-06-26",23.64,2.1166299999999998,7.4492380000000002,31.660594,null,"2024-06-27",22905.98,5.0553999999999997,13.395799999999999,35.636200000000002,null,"2024-06-26",2.1166299999999998,6.5911999999999997,null,7.4492380000000002,14.211600000000001,null,31.660594,34.746899999999997]
["2024-06-25",23.68,2.2894169999999998,7.3446680000000004,31.069693999999998,null,"2024-06-26",22986.69,6.5911999999999997,14.211600000000001,34.746899999999997,null,"2024-06-25",2.2894169999999998,6.0777000000000001,null,7.3446680000000004,13.2913,null,31.069693999999998,32.981900000000003]
["2024-06-24",23.76,2.634989,7.1371869999999999,31.512495999999999,null,"2024-06-25",22875.97,6.0777000000000001,13.2913,32.981900000000003,null,"2024-06-24",2.634989,5.7888999999999999,null,7.1371869999999999,12.780799999999999,null,31.512495999999999,32.619900000000001]
["2024-06-21",23.94,4.7702410000000004,7.9964719999999998,32.508803,null,"2024-06-24",22813.7,5.7888999999999999,12.780799999999999,32.619900000000001,null,"2024-06-21",4.7702410000000004,9.4962999999999997,null,7.9964719999999998,15.121499999999999,null,32.508803,35.175899999999999]
["2024-06-20",24.09,4.7846900000000003,10.180465,34.724400000000003,null,"2024-06-21",23253.39,9.4962999999999997,15.121499999999999,35.175899999999999,null,"2024-06-20",4.7846900000000003,10.034599999999999,null,10.180465,18.306000000000001,null,34.724400000000003,36.202100000000002]
["2024-06-19",23.95,4.4483220000000001,8.9066849999999995,33.24924,null,"2024-06-20",23406.1,10.034599999999999,18.306000000000001,36.202100000000002,null,"2024-06-19",4.4483220000000001,9.1781000000000006,null,8.9066849999999995,16.8827,null,33.24924,34.357300000000002]
["2024-06-18",23.59,2.8783270000000001,7.3651949999999999,30.840622,null,"2024-06-19",23209.54,9.1781000000000006,16.8827,34.357300000000002,null,"2024-06-18",2.8783270000000001,7.0514000000000001,null,7.3651949999999999,14.4754,null,30.840622,31.630800000000001]
["2024-06-17",23.35,1.831663,6.1783340000000004,29.509474999999998,null,"2024-06-18",22757.43,7.0514000000000001,14.4754,31.630800000000001,null,"2024-06-17",1.831663,5.8240999999999996,null,6.1783340000000004,14.297700000000001,null,29.509474999999998,30.1218]
["2024-06-14",23.42,2.6605699999999999,6.7816460000000003,30.773592000000001,null,"2024-06-17",22496.53,5.8240999999999996,14.297700000000001,30.1218,null,"2024-06-14",2.6605699999999999,7.2380000000000004,null,6.7816460000000003,12.874499999999999,null,30.773592000000001,30.552600000000002]
["2024-06-13",23.34,3.1057350000000001,5.4293740000000001,30.597835,null,"2024-06-14",22504.720000000001,7.2380000000000004,12.874499999999999,30.552600000000002,null,"2024-06-13",3.1057350000000001,6.9729999999999999,null,5.4293740000000001,11.960900000000001,null,30.597835,29.596699999999998]
["2024-06-12",23.01,1.691889,3.7095850000000001,30.309085,null,"2024-06-13",22312.04,6.9729999999999999,11.960900000000001,29.596699999999998,null,"2024-06-12",1.691889,6.4717000000000002,null,3.7095850000000001,10.718299999999999,null,30.309085,30.041699999999999]
["2024-06-11",22.91,1.2499420000000001,4.2703090000000001,29.33456,null,"2024-06-12",22048.959999999999,6.4717000000000002,10.718299999999999,30.041699999999999,null,"2024-06-11",1.2499420000000001,5.2313999999999998,null,4.2703090000000001,10.474,null,29.33456,29.0518]
["2024-06-07",23.01,3.3450530000000001,4.8655090000000003,31.275873000000001,null,"2024-06-11",21792.12,5.2313999999999998,10.474,29.0518,null,"2024-06-07",3.3450530000000001,5.8339999999999996,null,4.8655090000000003,10.9931,null,31.275873000000001,29.168199999999999]
["2024-06-06",23.02,4.2603280000000003,5.0985069999999997,32.456028000000003,null,"2024-06-07",21858.38,5.8339999999999996,10.9931,29.168199999999999,null,"2024-06-06",4.2603280000000003,6.7214,null,5.0985069999999997,12.324999999999999,null,32.456028000000003,30.671900000000001]
["2024-06-05",22.81,4.8421279999999998,4.9837420000000003,31.388144,null,"2024-06-06",21902.7,6.7214,12.324999999999999,30.671900000000001,null,"2024-06-05",4.8421279999999998,5.6794000000000002,null,4.9837420000000003,10.8218,null,31.388144,28.541499999999999]
["2024-06-04",22.96,5.5315760000000003,6.296297,32.820681,null,"2024-06-05",21484.880000000001,5.6794000000000002,10.8218,28.541499999999999,null,"2024-06-04",5.5315760000000003,5.0484999999999998,null,6.296297,10.6258,null,32.820681,27.831499999999998]
["2024-06-03",23.23,6.772583,8.0355880000000006,34.382595999999999,null,"2024-06-04",21356.62,5.0484999999999998,10.6258,27.831499999999998,null,"2024-06-03",6.772583,5.9344999999999999,null,8.0355880000000006,13.735099999999999,null,34.382595999999999,28.909700000000001]
["2024-05-31",22.98,5.9569999999999999,6.5819720000000004,34.526698000000003,null,"2024-06-03",21536.76,5.9344999999999999,13.735099999999999,28.909700000000001,null,"2024-05-31",5.9569999999999999,3.8128000000000002,null,6.5819720000000004,11.6387,null,34.526698000000003,27.7178]
["2024-05-30",23.1,6.5103,7.1385370000000004,35.376415999999999,null,"2024-05-31",21174.22,3.8128000000000002,11.6387,27.7178,null,"2024-05-30",6.5103,4.7455999999999996,null,7.1385370000000004,12.6418,null,35.376415999999999,28.5259]
["2024-05-29",23.28,6.810295,7.9733830000000001,36.208855999999997,null,"2024-05-30",21364.48,4.7455999999999996,12.6418,28.5259,null,"2024-05-29",6.810295,5.6940999999999997,null,7.9733830000000001,14.212999999999999,null,36.208855999999997,30.212399999999999]
["2024-05-28",23.59,10.717275000000001,10.717275000000001,39.080857000000002,null,"2024-05-29",21662.5,5.6940999999999997,14.212999999999999,30.212399999999999,null,"2024-05-28",10.717275000000001,8.6377000000000006,null,10.717275000000001,15.932700000000001,null,39.080857000000002,32.434899999999999]
["2024-05-27",23.59,10.717275000000001,10.717275000000001,39.080857000000002,null,"2024-05-28",21858.41,8.6377000000000006,15.932700000000001,32.434899999999999,null,"2024-05-27",10.717275000000001,8.3661999999999992,null,10.717275000000001,15.642899999999999,null,39.080857000000002,32.103900000000003]
["2024-05-24",23.15,7.565658,7.6705629999999996,37.998207000000001,null,"2024-05-27",21803.77,8.3661999999999992,15.642899999999999,32.103900000000003,null,"2024-05-24",7.565658,7.1214000000000004,null,7.6705629999999996,14.1677,null,37.998207000000001,33.454799999999999]
["2024-05-23",23.23,10.089117,8.042643,38.245446999999999,null,"2024-05-24",21565.34,7.1214000000000004,14.1677,33.454799999999999,null,"2024-05-23",10.089117,10.2463,null,8.042643,14.390499999999999,null,38.245446999999999,33.478099999999998]
["2024-05-22",23.23,10.3962,7.9943869999999997,38.092773999999999,null,"2024-05-23",21607.43,10.2463,14.390499999999999,33.478099999999998,null,"2024-05-22",10.3962,11.028,null,7.9943869999999997,14.3165,null,38.092773999999999,33.193300000000001]
["2024-05-21",22.85,8.0878209999999999,7.0405220000000002,35.758865999999998,null,"2024-05-22",21551.83,11.028,14.3165,33.193300000000001,null,"2024-05-21",8.0878209999999999,8.7553999999999998,null,7.0405220000000002,13.7096,null,35.758865999999998,31.2944]
["2024-05-20",22.99,8.7500649999999993,6.9264029999999996,36.590648999999999,null,"2024-05-21",21236.75,8.7553999999999998,13.7096,31.2944,null,"2024-05-20",8.7500649999999993,8.9339999999999993,null,6.9264029999999996,13.429600000000001,null,36.590648999999999,31.510100000000001]
["2024-05-17",22.93,6.1093510000000002,7.1260120000000002,38.449981000000001,null,"2024-05-20",21271.63,8.9339999999999993,13.429600000000001,31.510100000000001,null,"2024-05-17",6.1093510000000002,5.1707999999999998,null,7.1260120000000002,14.2484,null,38.449981000000001,33.488900000000001]
["2024-05-16",23.46,7.1722250000000001,7.219449,39.667400000000001,null,"2024-05-17",21258.47,5.1707999999999998,14.2484,33.488900000000001,null,"2024-05-16",7.1722250000000001,7.0461999999999998,null,7.219449,14.494400000000001,null,39.667400000000001,35.9221]
["2024-05-15",23.32,3.6444450000000002,7.0118799999999997,40.081865000000001,null,"2024-05-16",21304.26,7.0461999999999998,14.494400000000001,35.9221,null,"2024-05-15",3.6444450000000002,3.4106000000000001,null,7.0118799999999997,13.422800000000001,null,40.081865000000001,36.653700000000001]
["2024-05-14",23.32,2.460458,8.7268139999999992,40.555649000000003,null,"2024-05-15",21147.21,3.4106000000000001,13.422800000000001,36.653700000000001,null,"2024-05-14",2.460458,1.2021999999999999,null,8.7268139999999992,15.9689,null,40.555649000000003,35.372100000000003]
["2024-05-13",23.14,1.6695960000000001,7.8875849999999996,39.470742000000001,null,"2024-05-14",20985.85,1.2021999999999999,15.9689,35.372100000000003,null,"2024-05-13",1.6695960000000001,0.58420000000000005,null,7.8875849999999996,15.2608,null,39.470742000000001,34.545400000000001]
["2024-05-10",23.13,1.2697020000000001,7.8409610000000001,39.410469999999997,null,"2024-05-13",20857.71,0.58420000000000005,15.2608,34.545400000000001,null,"2024-05-10",1.2697020000000001,-0.26340000000000002,null,7.8409610000000001,14.4381,null,39.410469999999997,32.394500000000001]
["2024-05-09",22.76,-0.35026299999999999,6.1158780000000004,36.871766999999998,null,"2024-05-10",20708.84,-0.26340000000000002,14.4381,32.394500000000001,null,"2024-05-09",-0.35026299999999999,-1.1321000000000001,null,6.1158780000000004,13.6198,null,36.871766999999998,30.729600000000001]
["2024-05-08",22.85,0.26327299999999998,6.5354929999999998,37.800514999999997,null,"2024-05-09",20560.77,-1.1321000000000001,13.6198,30.729600000000001,null,"2024-05-08",0.26327299999999998,1.3851,null,6.5354929999999998,14.392099999999999,null,37.800514999999997,31.853999999999999]
["2024-05-07",22.76,0.39700000000000002,6.1158780000000004,37.879886999999997,null,"2024-05-08",20700.509999999998,1.3851,14.392099999999999,31.853999999999999,null,"2024-05-07",0.39700000000000002,1.5535000000000001,null,6.1158780000000004,14.132400000000001,null,37.879886999999997,32.173499999999997]
["2024-05-06",22.57,-0.441112,5.2300250000000004,36.728869000000003,null,"2024-05-07",20653.53,1.5535000000000001,14.132400000000001,32.173499999999997,null,"2024-05-06",-0.441112,0.91320000000000001,null,5.2300250000000004,13.412800000000001,null,36.728869000000003,31.340199999999999]
["2024-05-03",22.24,-1.8967799999999999,3.5965699999999998,34.653441000000001,null,"2024-05-06",20523.310000000001,0.91320000000000001,13.412800000000001,31.340199999999999,null,"2024-05-03",-1.8967799999999999,-3.5799999999999998E-2,null,3.5965699999999998,12.571099999999999,null,34.653441000000001,30.712900000000001]
["2024-05-02",22.21,-2.5449760000000001,3.4568270000000001,34.471805000000003,null,"2024-05-03",20330.32,-3.5799999999999998E-2,12.571099999999999,30.712900000000001,null,"2024-05-02",-2.5449760000000001,-1.1928000000000001,null,3.4568270000000001,11.973699999999999,null,34.471805000000003,29.328499999999998]
["2024-04-30",22.17,-3.4407670000000001,4.1279139999999996,34.994028,null,"2024-05-02",20222.439999999999,-1.1928000000000001,11.973699999999999,29.328499999999998,null,"2024-04-30",-3.4407670000000001,0.50339999999999996,null,4.1279139999999996,13.096500000000001,null,34.994028,30.9221]
["2024-04-29",22.28,-2.9616730000000002,4.4518449999999996,35.663822000000003,null,"2024-04-30",20396.599999999999,0.50339999999999996,13.096500000000001,30.9221,null,"2024-04-29",-2.9616730000000002,0.99080000000000001,null,4.4518449999999996,13.1119,null,35.663822000000003,31.556999999999999]
["2024-04-26",21.78,-3.1569590000000001,2.961042,34.147173000000002,null,"2024-04-29",20495.52,0.99080000000000001,13.1119,31.556999999999999,null,"2024-04-26",-3.1569590000000001,-2.98E-2,null,2.961042,11.8111,null,34.147173000000002,30.868099999999998]
["2024-04-25",21.69,-3.8137470000000002,1.498918,34.133705999999997,null,"2024-04-26",20120.509999999998,-2.98E-2,11.8111,30.868099999999998,null,"2024-04-25",-3.8137470000000002,-1.6583000000000001,null,1.498918,10.3026,null,34.133705999999997,29.189699999999998]
["2024-04-24",22,-2.9554469999999999,3.3294589999999999,34.418176000000003,null,"2024-04-25",19857.419999999998,-1.6583000000000001,10.3026,29.189699999999998,null,"2024-04-24",-2.9554469999999999,-0.47810000000000002,null,3.3294589999999999,12.6195,null,34.418176000000003,28.8276]
["2024-04-23",21.57,-4.8522280000000002,1.3098380000000001,32.244320999999999,null,"2024-04-24",20131.740000000002,-0.47810000000000002,12.6195,28.8276,null,"2024-04-23",{"$f":"IF(ISERROR(VLOOKUP($M131,XX_TEJ6,3,FALSE)=TRUE),\"\",VLOOKUP($M131,XX_TEJ6,3,FALSE))","v":-4.8522280000000002},{"$f":"IF(ISERROR(VLOOKUP($M131,XX_TEJ7,3,FALSE)=TRUE),\"\",VLOOKUP($M131,XX_TEJ7,3,FALSE))","v":-3.1103000000000001},null,{"$f":"IF(ISERROR(VLOOKUP($M131,XX_TEJ6,4,FALSE)=TRUE),\"\",VLOOKUP($M131,XX_TEJ6,4,FALSE))","v":1.3098380000000001},{"$f":"IF(ISERROR(VLOOKUP($M131,XX_TEJ7,4,FALSE)=TRUE),\"\",VLOOKUP($M131,XX_TEJ7,4,FALSE))","v":9.6484000000000005},null,{"$f":"IF(ISERROR(VLOOKUP($M131,XX_TEJ6,5,FALSE)=TRUE),\"\",VLOOKUP($M131,XX_TEJ6,5,FALSE))","v":32.244320999999999},{"$f":"IF(ISERROR(VLOOKUP($M131,XX_TEJ7,5,FALSE)=TRUE),\"\",VLOOKUP($M131,XX_TEJ7,5,FALSE))","v":25.612200000000001}]
["2024-04-22",21.51,-5.1168950000000004,0.98145199999999999,31.876465,null,"2024-04-23",19599.28,-3.1103000000000001,9.6484000000000005,25.612200000000001,null,{"$f":"IF($A132=\"\",\"\",$A132)","v":"2024-04-22"},-5.1168950000000004,-4.04,null,0.98145199999999999,8.9589999999999996,null,31.876465,24.4069]
["2024-04-19",21.61,-3.8701059999999998,3.3569909999999998,31.434466,null,"2024-04-22",19411.22,-4.04,8.9589999999999996,24.4069,null,"2024-04-19",-3.8701059999999998,-1.6624000000000001,null,3.3569909999999998,10.4376,null,31.434466,23.820499999999999]
["2024-04-18",22.13,-1.469279,8.4417760000000008,34.367866999999997,null,"2024-04-19",19527.12,-1.6624000000000001,10.4376,23.820499999999999,null,"2024-04-18",-1.469279,2.1194000000000002,null,8.4417760000000008,17.839400000000001,null,34.367866999999997,27.926100000000002]
["2024-04-17",22.09,-1.7348749999999999,8.4545349999999999,33.821030999999998,null,"2024-04-18",20301.2,2.1194000000000002,17.839400000000001,27.926100000000002,null,"2024-04-17",-1.7348749999999999,2.6970000000000001,null,8.4545349999999999,17.7806,null,33.821030999999998,26.621500000000001]
["2024-04-16",21.89,-2.624555,6.1419889999999997,32.459338000000002,null,"2024-04-17",20213.330000000002,2.6970000000000001,17.7806,26.621500000000001,null,"2024-04-16",-2.624555,1.115,null,6.1419889999999997,14.729100000000001,null,32.459338000000002,24.938099999999999]
["2024-04-15",22.5,8.8968000000000005E-2,8.1726120000000009,36.150530000000003,null,"2024-04-16",19901.96,1.115,14.729100000000001,24.938099999999999,null,"2024-04-15",8.8968000000000005E-2,3.8982000000000001,null,8.1726120000000009,16.543700000000001,null,36.150530000000003,28.377099999999999]
["2024-04-12",22.76,0.35273300000000002,9.2678360000000009,37.801811999999998,null,"2024-04-15",20449.77,3.8982000000000001,16.543700000000001,28.377099999999999,null,"2024-04-12",0.35273300000000002,4.1276999999999999,null,9.2678360000000009,18.407599999999999,null,37.801811999999998,30.148599999999998]
["2024-04-11",22.9,1.9590380000000001,9.7330129999999997,39.201210000000003,null,"2024-04-12",20736.57,4.1276999999999999,18.407599999999999,30.148599999999998,null,"2024-04-11",1.9590380000000001,5.2069000000000001,null,9.7330129999999997,18.283200000000001,null,39.201210000000003,30.409400000000002]
["2024-04-10",22.84,1.8279080000000001,10.223551,39.87021,null,"2024-04-11",20753.22,5.2069000000000001,18.283200000000001,30.409400000000002,null,"2024-04-10",1.8279080000000001,4.9440999999999997,null,10.223551,18.882000000000001,null,39.87021,30.784099999999999]
["2024-04-09",22.84,1.8279080000000001,9.4455030000000004,40.514032,null,"2024-04-10",20763.53,4.9440999999999997,18.882000000000001,30.784099999999999,null,"2024-04-09",1.8279080000000001,5.1092000000000004,null,9.4455030000000004,18.5947,null,40.514032,31.318000000000001]
["2024-04-08",22.79,1.6049929999999999,9.1032270000000004,40.206426999999998,null,"2024-04-09",20796.2,5.1092000000000004,18.5947,31.318000000000001,null,"2024-04-08",1.6049929999999999,3.1962000000000002,null,9.1032270000000004,16.189900000000002,null,40.206426999999998,28.927900000000001]
["2024-04-03",22.67,3.1392169999999999,8.5287469999999992,39.227851000000001,null,"2024-04-08",20417.7,3.1962000000000002,16.189900000000002,28.927900000000001,null,"2024-04-03",3.1392169999999999,7.4020000000000001,null,8.5287469999999992,15.822100000000001,null,39.227851000000001,28.166699999999999]
["2024-04-02",22.79,3.685168,7.2377830000000003,39.964830999999997,null,"2024-04-03",20337.599999999999,7.4020000000000001,15.822100000000001,28.166699999999999,null,"2024-04-02",3.685168,8.0831,null,7.2377830000000003,14.6343,null,39.964830999999997,28.979399999999998]
["2024-04-01",22.64,3.0027300000000001,5.1231949999999999,39.043605999999997,null,"2024-04-02",20466.57,8.0831,14.6343,28.979399999999998,null,"2024-04-01",3.0027300000000001,6.7931999999999997,null,5.1231949999999999,12.7796,null,39.043605999999997,27.440100000000001]
["2024-03-29",22.96,4.1742290000000004,6.6090350000000004,42.069716999999997,null,"2024-04-01",20222.330000000002,6.7931999999999997,12.7796,27.440100000000001,null,"2024-03-29",4.1742290000000004,6.9999000000000002,null,6.6090350000000004,13.181800000000001,null,42.069716999999997,28.691800000000001]
["2024-03-28",22.71,4.2699720000000001,5.7375170000000004,41.258512000000003,null,"2024-03-29",20294.45,6.9999000000000002,13.181800000000001,28.691800000000001,null,"2024-03-28",4.2699720000000001,6.8531000000000004,null,5.7375170000000004,12.485200000000001,null,41.258512000000003,28.3096]
["2024-03-27",22.69,4.1781449999999998,5.5961129999999999,40.561723000000001,null,"2024-03-28",20146.55,6.8531000000000004,12.485200000000001,28.3096,null,"2024-03-27",4.1781449999999998,7.1372,null,5.5961129999999999,12.9033,null,40.561723000000001,27.6038]
["2024-03-26",22.49,2.694064,5.9240360000000001,39.161493999999998,null,"2024-03-27",20200.12,7.1372,12.9033,27.6038,null,"2024-03-26",2.694064,6.2191999999999998,null,5.9240360000000001,13.377599999999999,null,39.161493999999998,26.464500000000001]
["2024-03-25",22.55,2.5999639999999999,7.0483560000000001,39.532755999999999,null,"2024-03-26",20126.490000000002,6.2191999999999998,13.377599999999999,26.464500000000001,null,"2024-03-25",2.5999639999999999,6.8982999999999999,null,7.0483560000000001,14.697100000000001,null,39.532755999999999,26.877800000000001]
["2024-03-22",22.67,3.0998830000000002,8.7332269999999994,41.751863999999998,null,"2024-03-25",20192.25,6.8982999999999999,14.697100000000001,26.877800000000001,null,"2024-03-22",3.0998830000000002,7.2967000000000004,null,8.7332269999999994,14.9564,null,41.751863999999998,28.349]
["2024-03-21",22.66,3.8428490000000002,8.8904259999999997,43.281350000000003,null,"2024-03-22",20228.43,7.2967000000000004,14.9564,28.349,null,"2024-03-21",3.8428490000000002,8.1533999999999995,null,8.8904259999999997,15.1357,null,43.281350000000003,30.203399999999998]
["2024-03-20",22.35,1.689986,7.1983940000000004,41.992949000000003,null,"2024-03-21",20199.09,8.1533999999999995,15.1357,30.203399999999998,null,"2024-03-20",1.689986,5.4991000000000003,null,7.1983940000000004,12.1874,null,41.992949000000003,28.303699999999999]
["2024-03-19",22.48,2.8790719999999999,9.0547579999999996,42.311509000000001,null,"2024-03-20",19784.45,5.4991000000000003,12.1874,28.303699999999999,null,"2024-03-19",2.8790719999999999,6.5540000000000003,null,9.0547579999999996,12.9757,null,42.311509000000001,28.500599999999999]
["2024-03-18",22.46,2.6491389999999999,8.4411020000000008,42.184897999999997,null,"2024-03-19",19857.2,6.5540000000000003,12.9757,28.500599999999999,null,"2024-03-18",2.6491389999999999,6.8391000000000002,null,8.4411020000000008,12.620900000000001,null,42.184897999999997,28.647099999999998]
["2024-03-15",22.48,3.1572490000000002,9.0547579999999996,43.329839,null,"2024-03-18",19879.849999999999,6.8391000000000002,12.620900000000001,28.647099999999998,null,"2024-03-15",3.1572490000000002,5.5667,null,9.0547579999999996,11.365,null,43.329839,27.911100000000001]
["2024-03-14",22.42,4.5306670000000002,7.5341389999999997,43.11797,null,"2024-03-15",19682.5,5.5667,11.365,27.911100000000001,null,"2024-03-14",4.5306670000000002,10.177899999999999,null,7.5341389999999997,12.9429,null,43.11797,29.8002]
["2024-03-13",22.63,5.5097680000000002,10.202455,42.838248999999998,null,"2024-03-14",19937.919999999998,10.177899999999999,12.9429,29.8002,null,"2024-03-13",5.5097680000000002,10.1259,null,10.202455,14.079800000000001,null,42.838248999999998,28.070799999999998]
["2024-03-12",22.68,5.7428879999999998,11.674308,42.648595999999998,null,"2024-03-13",19928.509999999998,10.1259,14.079800000000001,28.070799999999998,null,"2024-03-12",5.7428879999999998,10.0488,null,11.674308,14.1195,null,42.648595999999998,28.2638]
["2024-03-11",22.46,4.7171630000000002,10.805370999999999,41.264879000000001,null,"2024-03-12",19914.55,10.0488,14.1195,28.2638,null,"2024-03-11",4.7171630000000002,9.0073000000000008,null,10.805370999999999,13.2491,null,41.264879000000001,27.05]
["2024-03-08",22.43,4.5772919999999999,10.711005999999999,38.389802000000003,null,"2024-03-11",19726.080000000002,9.0073000000000008,13.2491,27.05,null,"2024-03-08",4.5772919999999999,9.3346999999999998,null,10.711005999999999,13.813599999999999,null,38.389802000000003,25.0792]
["2024-03-07",22.43,4.5772919999999999,11.358753999999999,38.230274000000001,null,"2024-03-08",19785.32,9.3346999999999998,13.813599999999999,25.0792,null,"2024-03-07",4.5772919999999999,8.8274000000000008,null,11.358753999999999,13.9756,null,38.230274000000001,24.1873]
["2024-03-06",22.39,4.3907970000000001,10.943796000000001,38.703263,null,"2024-03-07",19693.52,8.8274000000000008,13.9756,24.1873,null,"2024-03-06",4.3907970000000001,7.7549999999999999,null,10.943796000000001,12.3195,null,38.703263,23.6996]
["2024-03-05",22.21,3.5515669999999999,10.861089,38.875560999999998,null,"2024-03-06",19499.45,7.7549999999999999,12.3195,23.6996,null,"2024-03-05",3.5515669999999999,7.1332000000000004,null,10.861089,11.882199999999999,null,38.875560999999998,24.207799999999999]
["2024-03-04",22.08,2.8512719999999998,9.5676799999999993,38.062691999999998,null,"2024-03-05",19386.919999999998,7.1332000000000004,11.882199999999999,24.207799999999999,null,"2024-03-04",2.8512719999999998,6.8956999999999997,null,9.5676799999999993,10.813499999999999,null,38.062691999999998,23.684999999999999]
["2024-03-01",21.98,3.0454029999999999,9.177861,38.408698999999999,null,"2024-03-04",19305.310000000001,6.8956999999999997,10.813499999999999,23.684999999999999,null,"2024-03-01",3.0454029999999999,5.3860999999999999,null,9.177861,8.5881000000000007,null,38.408698999999999,21.395700000000001]
["2024-02-29",22.04,3.3266909999999998,9.2626930000000005,38.297834999999999,null,"2024-03-01",18935.93,5.3860999999999999,8.5881000000000007,21.395700000000001,null,"2024-02-29",3.3266909999999998,4.6750999999999996,null,9.2626930000000005,9.1895000000000007,null,38.297834999999999,22.336099999999998]
["2024-02-27",21.78,2.961042,9.4659829999999996,36.666370999999998,null,"2024-02-29",18966.77,4.6750999999999996,9.1895000000000007,22.336099999999998,null,"2024-02-27",2.961042,4.7755000000000001,null,9.4659829999999996,10.019299999999999,null,36.666370999999998,21.6114]
["2024-02-26",22.3,3.5283199999999999,9.2066599999999994,37.419353999999998,null,"2024-02-27",18854.41,4.7755000000000001,10.019299999999999,21.6114,null,"2024-02-26",3.5283199999999999,5.2958999999999996,null,9.2066599999999994,9.6062999999999992,null,37.419353999999998,22.215399999999999]
["2024-02-23",22.38,3.2287840000000001,9.813542,36.708914999999998,null,"2024-02-26",18948.05,5.2958999999999996,9.6062999999999992,22.215399999999999,null,"2024-02-23",3.2287840000000001,5.6760000000000002,null,9.813542,9.2209000000000003,null,36.708914999999998,20.9649]
["2024-02-22",22.39,3.2272959999999999,9.2728160000000006,37.973962,null,"2024-02-23",18889.189999999999,5.6760000000000002,9.2209000000000003,20.9649,null,"2024-02-22",3.2272959999999999,5.8244999999999996,null,9.2728160000000006,8.9114000000000004,null,37.973962,22.2714]
["2024-02-21",22.22,4.3682489999999996,7.1876509999999998,36.605699999999999,null,"2024-02-22",18852.78,5.8244999999999996,8.9114000000000004,22.2714,null,"2024-02-21",4.3682489999999996,5.6260000000000003,null,7.1876509999999998,7.2325999999999997,null,36.605699999999999,20.0044]
["2024-02-20",22.38,5.1197759999999999,9.9754299999999994,37.267887999999999,null,"2024-02-21",18676.310000000001,5.6260000000000003,7.2325999999999997,20.0044,null,"2024-02-20",5.1197759999999999,6.0606,null,9.9754299999999994,8.9641000000000002,null,37.267887999999999,20.589500000000001]
["2024-02-19",22.25,4.5091599999999996,9.4441710000000008,37.191749999999999,null,"2024-02-20",18753.16,6.0606,8.9641000000000002,20.589500000000001,null,"2024-02-19",4.5091599999999996,5.3967999999999998,null,9.4441710000000008,8.2916000000000007,null,37.191749999999999,20.388500000000001]
["2024-02-16",22.28,6.0952390000000003,10.133464999999999,37.781253,null,"2024-02-19",18635.8,5.3967999999999998,8.2916000000000007,20.388500000000001,null,"2024-02-16",6.0952390000000003,7.2656000000000001,null,10.133464999999999,8.3636999999999997,null,37.781253,19.6568]
["2024-02-15",22.19,4.7686510000000002,9.5261600000000008,38.447723000000003,null,"2024-02-16",18607.25,7.2656000000000001,8.3636999999999997,19.6568,null,"2024-02-15",4.7686510000000002,6.2561,null,9.5261600000000008,8.8498000000000001,null,38.447723000000003,20.810600000000001]
["2024-02-05",21.84,2.9217740000000001,11.142045,36.663606999999999,null,"2024-02-15",18644.57,6.2561,8.8498000000000001,20.810600000000001,null,"2024-02-05",2.9217740000000001,3.2932000000000001,null,11.142045,9.6227999999999998,null,36.663606999999999,15.980700000000001]
["2024-02-02",21.86,1.016637,11.578727000000001,36.628487999999997,null,"2024-02-05",18096.07,3.2932000000000001,9.6227999999999998,15.980700000000001,null,"2024-02-02",1.016637,1.1549,null,11.578727000000001,10.1425,null,36.628487999999997,15.8048]
["2024-02-01",21.72,-0.95759000000000005,12.845872,36.633943000000002,null,"2024-02-02",18059.93,1.1549,10.1425,15.8048,null,"2024-02-01",-0.95759000000000005,0.2082,null,12.845872,12.0313,null,36.633943000000002,16.523900000000001]
["2024-01-31",21.64,-1.3223879999999999,13.298197,37.345416,null,"2024-02-01",17968.11,0.2082,12.0313,16.523900000000001,null,"2024-01-31",-1.3223879999999999,-0.22989999999999999,null,13.298197,11.801399999999999,null,37.345416,17.1919]
["2024-01-30",21.68,-1.1399889999999999,11.895133,35.344883000000003,null,"2024-01-31",17889.560000000001,-0.22989999999999999,11.801399999999999,17.1919,null,"2024-01-30",-1.1399889999999999,0.57909999999999995,null,11.895133,11.6722,null,35.344883000000003,16.398900000000001]
["2024-01-29",21.72,-0.95759099999999997,12.044734,38.429608999999999,null,"2024-01-30",18034.63,0.57909999999999995,11.6722,16.398900000000001,null,"2024-01-29",-0.95759099999999997,1.0531999999999999,null,12.044734,12.3033,null,38.429608999999999,21.340199999999999]
["2024-01-26",21.54,-0.37002699999999999,11.79649,37.282401999999998,null,"2024-01-29",18119.63,1.0531999999999999,12.3033,21.340199999999999,null,"2024-01-26",-0.37002699999999999,1.3708,null,11.79649,11.9535,null,37.282401999999998,20.505800000000001]
["2024-01-25",21.76,1.445222,11.403687,38.684542999999998,null,"2024-01-26",17995.03,1.3708,11.9535,20.505800000000001,null,"2024-01-25",1.445222,2.2597999999999998,null,11.403687,10.048400000000001,null,38.684542999999998,20.556699999999999]
["2024-01-24",21.68,2.1196419999999998,11.161948000000001,38.174672999999999,null,"2024-01-25",18002.62,2.2597999999999998,10.048400000000001,20.556699999999999,null,"2024-01-24",2.1196419999999998,1.587,null,11.161948000000001,9.6024999999999991,null,38.174672999999999,19.707599999999999]
["2024-01-23",21.68,2.1196419999999998,12.580553999999999,38.174672999999999,null,"2024-01-24",17875.830000000002,1.587,9.6024999999999991,19.707599999999999,null,"2024-01-23",2.1196419999999998,1.58,null,12.580553999999999,9.9887999999999995,null,38.174672999999999,19.699300000000001]
["2024-01-22",21.69,2.1667450000000001,11.381641999999999,38.238405999999998,null,"2024-01-23",17874.59,1.58,9.9887999999999995,19.699300000000001,null,"2024-01-22",2.1667450000000001,1.2419,null,11.381641999999999,8.3600999999999992,null,38.238405999999998,19.300999999999998]
["2024-01-19",21.29,1.429252,8.5059780000000007,35.689058000000003,null,"2024-01-22",17815.099999999999,1.2419,8.3600999999999992,19.300999999999998,null,"2024-01-19",1.429252,0.59760000000000002,null,8.5059780000000007,7.4691000000000001,null,35.689058000000003,18.406400000000001]
["2024-01-18",20.78,-1.4698910000000001,5.4313349999999998,32.438639000000002,null,"2024-01-19",17681.52,0.59760000000000002,7.4691000000000001,18.406400000000001,null,"2024-01-18",-1.4698910000000001,-2.4028999999999998,null,5.4313349999999998,4.7866,null,32.438639000000002,15.368]
["2024-01-17",20.74,-1.191044,3.9836939999999998,32.183705000000003,null,"2024-01-18",17227.79,-2.4028999999999998,4.7866,15.368,null,"2024-01-17",-1.191044,-2.8969999999999998,null,3.9836939999999998,3.1204000000000001,null,32.183705000000003,14.926]
["2024-01-16",21,4.7641000000000003E-2,4.4124290000000004,34.161357000000002,null,"2024-01-17",17161.79,-2.8969999999999998,3.1204000000000001,14.926,null,"2024-01-16",4.7641000000000003E-2,-1.8499000000000001,null,4.4124290000000004,4.1718000000000002,null,34.161357000000002,16.211500000000001]
["2024-01-15",21.18,0.905192,4.6933559999999996,35.962629999999997,null,"2024-01-16",17346.87,-1.8499000000000001,4.1718000000000002,16.211500000000001,null,"2024-01-15",0.905192,-0.71860000000000002,null,4.6933559999999996,4.5541999999999998,null,35.962629999999997,18.366800000000001]
["2024-01-12",21.21,2.562862,3.2858350000000001,36.483693000000002,null,"2024-01-15",17546.82,-0.71860000000000002,4.5541999999999998,18.366800000000001,null,"2024-01-12",2.562862,0.35670000000000002,null,3.2858350000000001,4.0829000000000004,null,36.483693000000002,18.879100000000001]
["2024-01-11",21.25,2.955425,4.5314399999999999,36.32996,null,"2024-01-12",17512.830000000002,0.35670000000000002,4.0829000000000004,18.879100000000001,null,"2024-01-11",2.955425,0.72929999999999995,null,4.5314399999999999,5.2384000000000004,null,36.32996,18.939900000000002]
["2024-01-10",21.1,2.2782339999999999,3.5931980000000001,34.397834000000003,null,"2024-01-11",17545.32,0.72929999999999995,5.2384000000000004,18.939900000000002,null,"2024-01-10",{"$f":"IF(ISERROR(VLOOKUP($M195,XX_TEJ6,3,FALSE)=TRUE),\"\",VLOOKUP($M195,XX_TEJ6,3,FALSE))","v":2.2782339999999999},{"$f":"IF(ISERROR(VLOOKUP($M195,XX_TEJ7,3,FALSE)=TRUE),\"\",VLOOKUP($M195,XX_TEJ7,3,FALSE))","v":0.46989999999999998},null,{"$f":"IF(ISERROR(VLOOKUP($M195,XX_TEJ6,4,FALSE)=TRUE),\"\",VLOOKUP($M195,XX_TEJ6,4,FALSE))","v":3.5931980000000001},{"$f":"IF(ISERROR(VLOOKUP($M195,XX_TEJ7,4,FALSE)=TRUE),\"\",VLOOKUP($M195,XX_TEJ7,4,FALSE))","v":5.7209000000000003},null,{"$f":"IF(ISERROR(VLOOKUP($M195,XX_TEJ6,5,FALSE)=TRUE),\"\",VLOOKUP($M195,XX_TEJ6,5,FALSE))","v":34.397834000000003},{"$f":"IF(ISERROR(VLOOKUP($M195,XX_TEJ7,5,FALSE)=TRUE),\"\",VLOOKUP($M195,XX_TEJ7,5,FALSE))","v":17.9876}]
["2024-01-09",21.25,3.0053299999999998,4.3296419999999998,35.434123999999997,null,"2024-01-10",17465.63,0.46989999999999998,5.7209000000000003,17.9876,null,{"$f":"IF($A196=\"\",\"\",$A196)","v":"2024-01-09"},3.0053299999999998,0.87180000000000002,null,4.3296419999999998,6.1436999999999999,null,35.434123999999997,18.867000000000001]
["2024-01-08",21.27,3.1022759999999998,4.427835,38.456439000000003,null,"2024-01-09",17535.490000000002,0.87180000000000002,6.1436999999999999,18.867000000000001,null,"2024-01-08",3.1022759999999998,1.0855999999999999,null,4.427835,6.3686999999999996,null,38.456439000000003,22.258800000000001]
["2024-01-05",21.22,4.0196050000000003,4.7383959999999998,38.808492999999999,null,"2024-01-08",17572.66,1.0855999999999999,6.3686999999999996,22.258800000000001,null,"2024-01-05",4.0196050000000003,1.1032999999999999,null,4.7383959999999998,6.4768999999999997,null,38.808492999999999,22.502600000000001]
["2024-01-04",21.27,3.6549689999999999,6.0659179999999999,40.166832999999997,null,"2024-01-05",17519.14,1.1032999999999999,6.4768999999999997,22.502600000000001,null,"2024-01-04",3.6549689999999999,0.73599999999999999,null,6.0659179999999999,7.843,null,40.166832999999997,23.596699999999998]
["2024-01-03",21.27,3.7560959999999999,5.0871649999999997,40.253463000000004,null,"2024-01-04",17549.650000000001,0.73599999999999999,7.843,23.596699999999998,null,"2024-01-03",3.7560959999999999,0.69389999999999996,null,5.0871649999999997,6.7156000000000002,null,40.253463000000004,23.447399999999998]
["2024-01-02",21.64,5.5609739999999999,6.2443980000000003,43.491388000000001,null,"2024-01-03",17559.310000000001,0.69389999999999996,6.7156000000000002,23.447399999999998,null,"2024-01-02",5.5609739999999999,2.3824000000000001,null,6.2443980000000003,7.8303000000000003,null,43.491388000000001,26.284800000000001]
["2023-12-29",21.93,6.7672809999999997,9.679691,45.595308000000003,null,"2024-01-02",17853.759999999998,2.3824000000000001,7.8303000000000003,26.284800000000001,null,"2023-12-29",6.7672809999999997,3.2256,null,9.679691,9.6437000000000008,null,45.595308000000003,27.303999999999998]
["2023-12-28",21.87,7.2584580000000001,9.3796099999999996,44.567236999999999,null,"2023-12-29",17930.810000000001,3.2256,9.6437000000000008,27.303999999999998,null,"2023-12-28",7.2584580000000001,3.2822,null,9.3796099999999996,9.5188000000000006,null,44.567236999999999,26.368600000000001]
["2023-12-27",21.88,7.9960490000000002,9.6452480000000005,43.919981999999997,null,"2023-12-28",17910.37,3.2822,9.5188000000000006,26.368600000000001,null,"2023-12-27",7.9960490000000002,4.4005000000000001,null,9.6452480000000005,9.6943999999999999,null,43.919981999999997,24.866900000000001]
["2023-12-26",21.62,5.8765890000000001,8.7709879999999991,42.297511,null,"2023-12-27",17891.5,4.4005000000000001,9.6943999999999999,24.866900000000001,null,"2023-12-26",5.8765890000000001,2.6861000000000002,null,8.7709879999999991,9.0667000000000009,null,42.297511,24.2669]
["2023-12-25",21.45,5.0440719999999999,7.0159729999999998,41.527849000000003,null,"2023-12-26",17751.73,2.6861000000000002,9.0667000000000009,24.2669,null,"2023-12-25",5.0440719999999999,1.8363,null,7.0159729999999998,7.0061,null,41.527849000000003,23.3552]
["2023-12-22",21.23,3.6115159999999999,6.2832499999999998,39.044412000000001,null,"2023-12-25",17604.84,1.8363,7.0061,23.3552,null,"2023-12-22",3.6115159999999999,1.6545000000000001,null,6.2832499999999998,7.6612,null,39.044412000000001,21.8352]
["2023-12-21",21.19,2.2190050000000001,6.8719169999999998,41.033430000000003,null,"2023-12-22",17596.63,1.6545000000000001,7.6612,21.8352,null,"2023-12-21",2.2190050000000001,0.72960000000000003,null,6.8719169999999998,7.5204000000000004,null,41.033430000000003,23.2485]
["2023-12-20",21.23,4.3243239999999998,6.0744439999999997,41.564594,null,"2023-12-21",17543.740000000002,0.72960000000000003,7.5204000000000004,23.2485,null,"2023-12-20",4.3243239999999998,2.468,null,6.0744439999999997,6.6555,null,41.564594,24.453800000000001]
["2023-12-19",20.99,3.2464330000000001,4.6696600000000004,38.236286,null,"2023-12-20",17635.2,2.468,6.6555,24.453800000000001,null,"2023-12-19",3.2464330000000001,2.1362000000000001,null,4.6696600000000004,5.6517999999999997,null,38.236286,21.777100000000001]
["2023-12-18",21.09,3.7383169999999999,4.5023770000000001,38.042751000000003,null,"2023-12-19",17576.55,2.1362000000000001,5.6517999999999997,21.777100000000001,null,"2023-12-18",3.7383169999999999,2.5748000000000002,null,4.5023770000000001,5.7119999999999997,null,38.042751000000003,21.4984]
["2023-12-15",20.99,3.6031580000000001,2.6567820000000002,36.717205999999997,null,"2023-12-18",17652.03,2.5748000000000002,5.7119999999999997,21.4984,null,"2023-12-15",3.6031580000000001,3.1823999999999999,null,2.6567820000000002,4.45,null,36.717205999999997,19.9514]
["2023-12-14",21.23,5.2473530000000004,3.8305609999999999,37.775759999999998,null,"2023-12-15",17673.87,3.1823999999999999,4.45,19.9514,null,"2023-12-14",5.2473530000000004,4.3593999999999999,null,3.8305609999999999,5.0309999999999997,null,37.775759999999998,19.768000000000001]
["2023-12-13",20.91,4.7327859999999999,4.0666760000000002,37.370235000000001,null,"2023-12-14",17653.11,4.3593999999999999,5.0309999999999997,19.768000000000001,null,"2023-12-13",4.7327859999999999,3.7393000000000001,null,4.0666760000000002,5.3521000000000001,null,37.370235000000001,20.284500000000001]
["2023-12-12",20.68,3.5297990000000001,3.123799,34.369906999999998,null,"2023-12-13",17468.93,3.7393000000000001,5.3521000000000001,20.284500000000001,null,"2023-12-12",3.5297990000000001,4.6033999999999997,null,3.123799,5.2976000000000001,null,34.369906999999998,19.421399999999998]
["2023-12-11",20.64,3.3295490000000001,2.8235269999999999,34.437500999999997,null,"2023-12-12",17450.63,4.6033999999999997,5.2976000000000001,19.421399999999998,null,"2023-12-11",3.3295490000000001,4.4099000000000004,null,2.8235269999999999,5.9966999999999997,null,34.437500999999997,18.447900000000001]
["2023-12-08",20.63,2.824065,0.557697,35.114755000000002,null,"2023-12-11",17418.34,4.4099000000000004,5.9966999999999997,18.447900000000001,null,"2023-12-08",2.824065,3.8418999999999999,null,0.557697,4.8746,null,35.114755000000002,19.452100000000002]
["2023-12-07",20.51,3.4936440000000002,-0.40898099999999998,33.835875000000001,null,"2023-12-08",17383.990000000002,3.8418999999999999,4.8746,19.452100000000002,null,"2023-12-07",3.4936440000000002,3.5589,null,-0.40898099999999998,3.9691000000000001,null,33.835875000000001,18.104299999999999]
["2023-12-06",20.55,3.438939,-0.68879100000000004,33.525222999999997,null,"2023-12-07",17278.740000000002,3.5589,3.9691000000000001,18.104299999999999,null,"2023-12-06",3.438939,4.2727000000000004,null,-0.68879100000000004,3.7195999999999998,null,33.525222999999997,17.867999999999999]
["2023-12-05",20.399999999999999,3.8139989999999999,-1.1318809999999999,30.798114999999999,null,"2023-12-06",17360.72,4.2727000000000004,3.7195999999999998,17.867999999999999,null,"2023-12-05",3.8139989999999999,4.9696999999999996,null,-1.1318809999999999,3.1945999999999999,null,30.798114999999999,15.667999999999999]
["2023-12-04",20.52,4.4246689999999997,-0.40796199999999999,31.884546,null,"2023-12-05",17328.009999999998,4.9696999999999996,3.1945999999999999,15.667999999999999,null,"2023-12-04",4.4246689999999997,5.5358999999999998,null,-0.40796199999999999,3.7631000000000001,null,31.884546,16.370100000000001]
["2023-12-01",20.5,6.5073840000000001,0.26031599999999999,31.439281999999999,null,"2023-12-04",17421.48,5.5358999999999998,3.7631000000000001,16.370100000000001,null,"2023-12-01",6.5073840000000001,8.7277000000000005,null,0.26031599999999999,4.7667000000000002,null,31.439281999999999,16.155899999999999]
["2023-11-30",20.64,6.5274700000000001,-1.636E-2,32.257435000000001,null,"2023-12-01",17438.349999999999,8.7277000000000005,4.7667000000000002,16.155899999999999,null,"2023-11-30",6.5274700000000001,7.9516999999999998,null,-1.636E-2,4.2706,null,32.257435000000001,17.165800000000001]
["2023-11-29",20.54,5.9575899999999997,-0.21567900000000001,33.216855000000002,null,"2023-11-30",17433.849999999999,7.9516999999999998,4.2706,17.165800000000001,null,"2023-11-29",5.9575899999999997,7.6601999999999997,null,-0.21567900000000001,4.4931000000000001,null,33.216855000000002,18.088899999999999]
["2023-11-28",20.39,5.1837999999999997,-0.27766600000000002,33.379136000000003,null,"2023-11-29",17370.560000000001,7.6601999999999997,4.4931000000000001,18.088899999999999,null,"2023-11-28",5.1837999999999997,7.4786000000000001,null,-0.27766600000000002,5.0396000000000001,null,33.379136000000003,19.126899999999999]
["2023-11-27",20.260000000000002,4.5131829999999997,-1.2931049999999999,32.043005000000001,null,"2023-11-28",17341.25,7.4786000000000001,5.0396000000000001,19.126899999999999,null,"2023-11-27",4.5131829999999997,6.2152000000000003,null,-1.2931049999999999,3.9792000000000001,null,32.043005000000001,15.9611]
["2023-11-24",20.420000000000002,4.7014319999999996,-2.7947410000000001,32.680537999999999,null,"2023-11-27",17137.419999999998,6.2152000000000003,3.9792000000000001,15.9611,null,"2023-11-24",4.7014319999999996,5.9943,null,-2.7947410000000001,3.08,null,32.680537999999999,16.932700000000001]
["2023-11-23",20.38,5.8298769999999998,-2.7120000000000002,34.053441999999997,null,"2023-11-24",17287.419999999998,5.9943,3.08,16.932700000000001,null,"2023-11-23",5.8298769999999998,6.4191000000000003,null,-2.7120000000000002,4.3291000000000004,null,34.053441999999997,18.385999999999999]
["2023-11-22",20.49,5.2194510000000003,-1.213398,35.781537999999998,null,"2023-11-23",17294.55,6.4191000000000003,4.3291000000000004,18.385999999999999,null,"2023-11-22",5.2194510000000003,5.2888999999999999,null,-1.213398,5.3087999999999997,null,35.781537999999998,19.034199999999998]
["2023-11-21",20.73,6.4518890000000004,0.32406800000000002,37.286679999999997,null,"2023-11-22",17310.259999999998,5.2888999999999999,5.3087999999999997,19.034199999999998,null,"2023-11-21",6.4518890000000004,5.9363000000000001,null,0.32406800000000002,6.3193000000000001,null,37.286679999999997,20.535299999999999]
["2023-11-20",20.350000000000001,4.5005280000000001,-1.5149649999999999,33.608992999999998,null,"2023-11-21",17416.7,5.9363000000000001,6.3193000000000001,20.535299999999999,null,"2023-11-20",4.5005280000000001,4.6818999999999997,null,-1.5149649999999999,5.0614999999999997,null,33.608992999999998,18.651499999999999]
["2023-11-17",20.329999999999998,1.9280870000000001,-3.3136559999999999,32.661304000000001,null,"2023-11-20",17210.47,4.6818999999999997,5.0614999999999997,18.651499999999999,null,"2023-11-17",1.9280870000000001,3.4033000000000002,null,-3.3136559999999999,4.1913999999999998,null,32.661304000000001,18.394300000000001]
["2023-11-16",20.23,0.58397500000000002,-3.3827159999999998,31.847483,null,"2023-11-17",17208.95,3.4033000000000002,4.1913999999999998,18.394300000000001,null,"2023-11-16",0.58397500000000002,3.1162999999999998,null,-3.3827159999999998,4.4043999999999999,null,31.847483,18.117100000000001]
["2023-11-15",20.61,0.14577100000000001,-1.622914,31.161650000000002,null,"2023-11-16",17171.18,3.1162999999999998,4.4043999999999999,18.117100000000001,null,"2023-11-15",0.14577100000000001,2.0628000000000002,null,-1.622914,4.0959000000000003,null,31.161650000000002,17.7529]
["2023-11-14",20.52,-0.29154600000000003,-0.70054300000000003,30.823063999999999,null,"2023-11-15",17128.78,2.0628000000000002,4.0959000000000003,17.7529,null,"2023-11-14",-0.29154600000000003,0.79330000000000001,null,-0.70054300000000003,3.1844000000000001,null,30.823063999999999,19.335100000000001]
["2023-11-13",20.309999999999999,-1.3119540000000001,-2.36734,31.448494,null,"2023-11-14",16915.71,0.79330000000000001,3.1844000000000001,19.335100000000001,null,"2023-11-13",-1.3119540000000001,0.33789999999999998,null,-2.36734,1.4339,null,31.448494,20.215199999999999]
["2023-11-10",20.32,-1.9305019999999999,-2.1805180000000002,34.283631,null,"2023-11-13",16839.29,0.33789999999999998,1.4339,20.215199999999999,null,"2023-11-10",-1.9305019999999999,0.98119999999999996,null,-2.1805180000000002,0.28839999999999999,null,34.283631,23.540400000000002]
["2023-11-09",20.41,-1.49614,-3.7970419999999998,34.047857999999998,null,"2023-11-10",16682.669999999998,0.98119999999999996,0.28839999999999999,23.540400000000002,null,"2023-11-09",-1.49614,1.3624000000000001,null,-3.7970419999999998,-0.74260000000000004,null,34.047857999999998,22.7789]
["2023-11-08",20.41,-1.49614,-4.2851559999999997,34.962009999999999,null,"2023-11-09",16745.650000000001,1.3624000000000001,-0.74260000000000004,22.7789,null,"2023-11-08",-1.49614,1.3331999999999999,null,-4.2851559999999997,-0.80720000000000003,null,34.962009999999999,25.419899999999998]
["2023-11-07",20.16,-2.7027030000000001,-5.8051399999999997,34.140495000000001,null,"2023-11-08",16740.830000000002,1.3331999999999999,-0.80720000000000003,25.419899999999998,null,"2023-11-07",-2.7027030000000001,0.995,null,-5.8051399999999997,-1.8302,null,34.140495000000001,26.1737]
["2023-11-06",20.21,-2.4613909999999999,-2.8020960000000001,36.086184000000003,null,"2023-11-07",16684.95,0.995,-1.8302,26.1737,null,"2023-11-06",-2.4613909999999999,0.77949999999999997,null,-2.8020960000000001,-1.1537999999999999,null,36.086184000000003,27.808700000000002]
["2023-11-03",19.989999999999998,-2.9140359999999998,-4.1322570000000001,35.288063999999999,null,"2023-11-06",16649.36,0.77949999999999997,-1.1537999999999999,27.808700000000002,null,"2023-11-03",-2.9140359999999998,0.32390000000000002,null,-4.1322570000000001,-2.2854999999999999,null,35.288063999999999,27.112200000000001]
["2023-11-02",19.93,-3.8127420000000001,-4.4200039999999996,34.796464999999998,null,"2023-11-03",16507.650000000001,0.32390000000000002,-2.2854999999999999,27.112200000000001,null,"2023-11-02",-3.8127420000000001,-0.96860000000000002,null,-4.4200039999999996,-2.9407999999999999,null,34.796464999999998,25.165299999999998]
["2023-11-01",19.579999999999998,-3.7364799999999998,-9.4307929999999995,32.261504000000002,null,"2023-11-02",16396.95,-0.96860000000000002,-2.9407999999999999,25.165299999999998,null,"2023-11-01",-3.7364799999999998,-1.9274,null,-9.4307929999999995,-6.8224999999999998,null,32.261504000000002,23.020700000000001]
["2023-10-31",19.43,-4.4739430000000002,-9.9607759999999992,32.084774000000003,null,"2023-11-01",16038.56,-1.9274,-6.8224999999999998,23.020700000000001,null,"2023-10-31",-4.4739430000000002,-2.1554000000000002,null,-9.9607759999999992,-6.6734999999999998,null,32.084774000000003,23.563700000000001]
["2023-10-30",19.71,-3.0973449999999998,-11.487263,35.107649000000002,null,"2023-10-31",16001.27,-2.1554000000000002,-6.6734999999999998,23.563700000000001,null,"2023-10-30",-3.0973449999999998,-1.2478,null,-11.487263,-6.6112000000000002,null,35.107649000000002,26.283000000000001]
["2023-10-27",19.72,-2.8571430000000002,-9.7278219999999997,34.916075999999997,null,"2023-10-30",16149.68,-1.2478,-6.6112000000000002,26.283000000000001,null,"2023-10-27",-2.8571430000000002,-1.0774999999999999,null,-9.7278219999999997,-6.4218000000000002,null,34.916075999999997,24.8187]
["2023-10-26",19.600000000000001,-3.066271,-10.679309999999999,34.526536,null,"2023-10-27",16134.61,-1.0774999999999999,-6.4218000000000002,24.8187,null,"2023-10-26",-3.066271,-1.2431000000000001,null,-10.679309999999999,-6.3441999999999998,null,34.526536,26.275400000000001]
["2023-10-25",19.87,-2.5502699999999998,-8.9591860000000008,37.174151999999999,null,"2023-10-26",16073.74,-1.2431000000000001,-6.3441999999999998,26.275400000000001,null,"2023-10-25",-2.5502699999999998,-0.56730000000000003,null,-8.9591860000000008,-4.8841999999999999,null,37.174151999999999,29.1541]
["2023-10-24",19.84,-2.362206,-9.1375879999999992,36.878450000000001,null,"2023-10-25",16358.89,-0.56730000000000003,-4.8841999999999999,29.1541,null,"2023-10-24",-2.362206,-0.21240000000000001,null,-9.1375879999999992,-4.2496999999999998,null,36.878450000000001,26.854700000000001]
["2023-10-23",19.59,-3.5925199999999999,-8.426304,35.153671000000003,null,"2023-10-24",16309.76,-0.21240000000000001,-4.2496999999999998,26.854700000000001,null,"2023-10-23",-3.5925199999999999,-0.56969999999999998,null,-8.426304,-4.5762,null,35.153671000000003,26.7729]
["2023-10-20",19.809999999999999,-2.7013760000000002,-5.30816,35.793123999999999,null,"2023-10-23",16251.36,-0.56969999999999998,-4.5762,26.7729,null,"2023-10-20",-2.7013760000000002,"",null,-5.30816,"",null,35.793123999999999,""]
[null,null,null,null,null,null,null,null,null,null,null,null,"","","",null,"","",null,"",""]
[null,null,null,null,null,null,null,null,null,null,null,null,"","","",null,"","",null,"",""]
[null,null,null,null,null,null,null,null,null,null,null,null,"","","",null,"","",null,"",""]
[null,null,null,null,null,null,null,null,null,null,null,null,"","","",null,"","",null,"",""]
[null,null,null,null,null,null,null,null,null,null,null,null,"","","",null,"","",null,"",""]
[null,null,null,null,null,null,null,null,null,null,null,null,"","","",null,"","",null,"",""]
[null,null,null,null,null,null,null,null,null,null,null,null,"",{"$f":"IF(ISERROR(VLOOKUP($M259,XX_TEJ6,3,FALSE)=TRUE),\"\",VLOOKUP($M259,XX_TEJ6,3,FALSE))","v":""},{"$f":"IF(ISERROR(VLOOKUP($M259,XX_TEJ7,3,FALSE)=TRUE),\"\",VLOOKUP($M259,XX_TEJ7,3,FALSE))","v":""},null,{"$f":"IF(ISERROR(VLOOKUP($M259,XX_TEJ6,4,FALSE)=TRUE),\"\",VLOOKUP($M259,XX_TEJ6,4,FALSE))","v":""},{"$f":"IF(ISERROR(VLOOKUP($M259,XX_TEJ7,4,FALSE)=TRUE),\"\",VLOOKUP($M259,XX_TEJ7,4,FALSE))","v":""},null,{"$f":"IF(ISERROR(VLOOKUP($M259,XX_TEJ6,5,FALSE)=TRUE),\"\",VLOOKUP($M259,XX_TEJ6,5,FALSE))","v":""},{"$f":"IF(ISERROR(VLOOKUP($M259,XX_TEJ7,5,FALSE)=TRUE),\"\",VLOOKUP($M259,XX_TEJ7,5,FALSE))","v":""}]
[null,null,null,null,null,null,null,null,null,null,null,null,{"$f":"IF($A260=\"\",\"\",$A260)","v":""},"","",null,"","",null,"",""]
[null,null,null,null,null,null,null,null,null,null,null,null,"","","",null,"","",null,"",""]
[null,null,null,null,null,null,null,null,null,null,null,null,"","","",null,"","",null,"",""]
[null,null,null,null,null,null,null,null,null,null,null,null,"","","",null,"","",null,"",""]
[null,null,null,null,null,null,null,null,null,null,null,null,"","","",null,"","",null,"",""]
[null,null,null,null,null,null,null,null,null,null,null,null,"","","",null,"","",null,"",""]
[null,null,null,null,null,null,null,null,null,null,null,null,"","","",null,"","",null,"",""]
[null,null,null,null,null,null,null,null,null,null,null,null,"","","",null,"","",null,"",""]
[null,null,null,null,null,null,null,null,null,null,null,null,"","","",null,"","",null,"",""]
[null,null,null,null,null,null,null,null,null,null,null,null,"","","",null,"","",null,"",""]
[null,null,null,null,null,null,null,null,null,null,null,null,"","","",null,"","",null,"",""]
[null,null,null,null,null,null,null,null,null,null,null,null,"","","",null,"","",null,"",""]
[null,null,null,null,null,null,null,null,null,null,null,null,"","","",null,"","",null,"",""]
[null,null,null,null,null,null,null,null,null,null,null,null,"","","",null,"","",null,"",""]
[null,null,null,null,null,null,null,null,null,null,null,null,"","","",null,"","",null,"",""]
[null,null,null,null,null,null,null,null,null,null,null,null,"","","",null,"","",null,"",""]
[null,null,null,null,null,null,null,null,null,null,null,null,"","","",null,"","",null,"",""]
[null,null,null,null,null,null,null,null,null,null,null,null,"","","",null,"","",null,"",""]
[null,null,null,null,null,null,null,null,null,null,null,null,"","","",null,"","",null,"",""]
[null,null,null,null,null,null,null,null,null,null,null,null,"","","",null,"","",null,"",""]
[null,null,null,null,null,null,null,null,null,null,null,null,"","","",null,"","",null,"",""]
[null,null,null,null,null,null,null,null,null,null,null,null,"","","",null,"","",null,"",""]
[null,null,null,null,null,null,null,null,null,null,null,null,"","","",null,"","",null,"",""]
[null,null,null,null,null,null,null,null,null,null,null,null,"","","",null,"","",null,"",""]
[null,null,null,null,null,null,null,null,null,null,null,null,"","","",null,"","",null,"",""]
[null,null,null,null,null,null,null,null,null,null,null,null,"","","",null,"","",null,"",""]
[null,null,null,null,null,null,null,null,null,null,null,null,"","","",null,"","",null,"",""]
[null,null,null,null,null,null,null,null,null,null,null,null,"","","",null,"","",null,"",""]
[null,null,null,null,null,null,null,null,null,null,null,null,"","","",null,"","",null,"",""]
[null,null,null,null,null,null,null,null,null,null,null,null,"","","",null,"","",null,"",""]
[null,null,null,null,null,null,null,null,null,null,null,null,"","","",null,"","",null,"",""]
[null,null,null,null,null,null,null,null,null,null,null,null,"","","",null,"","",null,"",""]
[null,null,null,null,null,null,null,null,null,null,null,null,"","","",null,"","",null,"",""]
[null,null,null,null,null,null,null,null,null,null,null,null,"","","",null,"","",null,"",""]
[null,null,null,null,null,null,null,null,null,null,null,null,"","","",null,"","",null,"",""]
[null,null,null,null,null,null,null,null,null,null,null,null,"","","",null,"","",null,"",""]
[null,null,null,null,null,null,null,null,null,null,null,null,"","","",null,"","",null,"",""]
[null,null,null,null,null,null,null,null,null,null,null,null,"","","",null,"","",null,"",""]
[null,null,null,null,null,null,null,null,null,null,null,null,"","","",null,"","",null,"",""]
[null,null,null,null,null,null,null,null,null,null,null,null,"","","",null,"","",null,"",""]
[null,null,null,null,null,null,null,null,null,null,null,null,"","","",null,"","",null,"",""]
[null,null,null,null,null,null,null,null,null,null,null,null,"","","",null,"","",null,"",""]
[null,null,null,null,null,null,null,null,null,null,null,null,"","","",null,"","",null,"",""]
[null,null,null,null,null,null,null,null,null,null,null,null,"","","",null,"","",null,"",""]
[null,null,null,null,null,null,null,null,null,null,null,null,"","","",null,"","",null,"",""]
[null,null,null,null,null,null,null,null,null,null,null,null,"","","",null,"","",null,"",""]
[null,null,null,null,null,null,null,null,null,null,null,null,"","","",null,"","",null,"",""]
[null,null,null,null,null,null,null,null,null,null,null,null,"","","",null,"","",null,"",""]
[null,null,null,null,null,null,null,null,null,null,null,null,"","","",null,"","",null,"",""]
[null,null,null,null,null,null,null,null,null,null,null,null,"","","",null,"","",null,"",""]
[null,null,null,null,null,null,null,null,null,null,null,null,"","","",null,"","",null,"",""]
[null,null,null,null,null,null,null,null,null,null,null,null,"","","",null,"","",null,"",""]
[null,null,null,null,null,null,null,null,null,null,null,null,"","","",null,"","",null,"",""]
[null,null,null,null,null,null,null,null,null,null,null,null,"","","",null,"","",null,"",""]
[null,null,null,null,null,null,null,null,null,null,null,null,"","","",null,"","",null,"",""]
[null,null,null,null,null,null,null,null,null,null,null,null,"","","",null,"","",null,"",""]
[null,null,null,null,null,null,null,null,null,null,null,null,"","","",null,"","",null,"",""]
[null,null,null,null,null,null,null,null,null,null,null,null,"","","",null,"","",null,"",""]
[null,null,null,null,null,null,null,null,null,null,null,null,"","","",null,"","",null,"",""]
[null,null,null,null,null,null,null,null,null,null,null,null,"","","",null,"","",null,"",""]
[null,null,null,null,null,null,null,null,null,null,null,null,"","","",null,"","",null,"",""]
[null,null,null,null,null,null,null,null,null,null,null,null,"","","",null,"","",null,"",""]
[null,null,null,null,null,null,null,null,null,null,null,null,"","","",null,"","",null,"",""]
[null,null,null,null,null,null,null,null,null,null,null,null,"",{"$f":"IF(ISERROR(VLOOKUP($M323,XX_TEJ6,3,FALSE)=TRUE),\"\",VLOOKUP($M323,XX_TEJ6,3,FALSE))","v":""},{"$f":"IF(ISERROR(VLOOKUP($M323,XX_TEJ7,3,FALSE)=TRUE),\"\",VLOOKUP($M323,XX_TEJ7,3,FALSE))","v":""},null,{"$f":"IF(ISERROR(VLOOKUP($M323,XX_TEJ6,4,FALSE)=TRUE),\"\",VLOOKUP($M323,XX_TEJ6,4,FALSE))","v":""},{"$f":"IF(ISERROR(VLOOKUP($M323,XX_TEJ7,4,FALSE)=TRUE),\"\",VLOOKUP($M323,XX_TEJ7,4,FALSE))","v":""},null,{"$f":"IF(ISERROR(VLOOKUP($M323,XX_TEJ6,5,FALSE)=TRUE),\"\",VLOOKUP($M323,XX_TEJ6,5,FALSE))","v":""},{"$f":"IF(ISERROR(VLOOKUP($M323,XX_TEJ7,5,FALSE)=TRUE),\"\",VLOOKUP($M323,XX_TEJ7,5,FALSE))","v":""}]
[null,null,null,null,null,null,null,null,null,null,null,null,{"$f":"IF($A324=\"\",\"\",$A324)","v":""},"","",null,"","",null,"",""]
[null,null,null,null,null,null,null,null,null,null,null,null,"","","",null,"","",null,"",""]
[null,null,null,null,null,null,null,null,null,null,null,null,"","","",null,"","",null,"",""]
[null,null,null,null,null,null,null,null,null,null,null,null,"","","",null,"","",null,"",""]
[null,null,null,null,null,null,null,null,null,null,null,null,"","","",null,"","",null,"",""]
[null,null,null,null,null,null,null,null,null,null,null,null,"","","",null,"","",null,"",""]
[null,null,null,null,null,null,null,null,null,null,null,null,"","","",null,"","",null,"",""]
[null,null,null,null,null,null,null,null,null,null,null,null,"","","",null,"","",null,"",""]
[null,null,null,null,null,null,null,null,null,null,null,null,"","","",null,"","",null,"",""]
[null,null,null,null,null,null,null,null,null,null,null,null,"","","",null,"","",null,"",""]
[null,null,null,null,null,null,null,null,null,null,null,null,"","","",null,"","",null,"",""]
[null,null,null,null,null,null,null,null,null,null,null,null,"","","",null,"","",null,"",""]
[null,null,null,null,null,null,null,null,null,null,null,null,"","","",null,"","",null,"",""]
[null,null,null,null,null,null,null,null,null,null,null,null,"","","",null,"","",null,"",""]
[null,null,null,null,null,null,null,null,null,null,null,null,"","","",null,"","",null,"",""]
[null,null,null,null,null,null,null,null,null,null,null,null,"","","",null,"","",null,"",""]
[null,null,null,null,null,null,null,null,null,null,null,null,"","","",null,"","",null,"",""]
[null,null,null,null,null,null,null,null,null,null,null,null,"","","",null,"","",null,"",""]
[null,null,null,null,null,null,null,null,null,null,null,null,"","","",null,"","",null,"",""]
[null,null,null,null,null,null,null,null,null,null,null,null,"","","",null,"","",null,"",""]
[null,null,null,null,null,null,null,null,null,null,null,null,"","","",null,"","",null,"",""]
[null,null,null,null,null,null,null,null,null,null,null,null,"","","",null,"","",null,"",""]
[null,null,null,null,null,null,null,null,null,null,null,null,"","","",null,"","",null,"",""]
[null,null,null,null,null,null,null,null,null,null,null,null,"","","",null,"","",null,"",""]
[null,null,null,null,null,null,null,null,null,null,null,null,"","","",null,"","",null,"",""]
[null,null,null,null,null,null,null,null,null,null,null,null,"","","",null,"","",null,"",""]
[null,null,null,null,null,null,null,null,null,null,null,null,"","","",null,"","",null,"",""]
[null,null,null,null,null,null,null,null,null,null,null,null,"","","",null,"","",null,"",""]
[null,null,null,null,null,null,null,null,null,null,null,null,"","","",null,"","",null,"",""]
[null,null,null,null,null,null,null,null,null,null,null,null,"","","",null,"","",null,"",""]
[null,null,null,null,null,null,null,null,null,null,null,null,"","","",null,"","",null,"",""]
[null,null,null,null,null,null,null,null,null,null,null,null,"","","",null,"","",null,"",""]
[null,null,null,null,null,null,null,null,null,null,null,null,"","","",null,"","",null,"",""]
[null,null,null,null,null,null,null,null,null,null,null,null,"","","",null,"","",null,"",""]
[null,null,null,null,null,null,null,null,null,null,null,null,"","","",null,"","",null,"",""]
[null,null,null,null,null,null,null,null,null,null,null,null,"","","",null,"","",null,"",""]
[null,null,null,null,null,null,null,null,null,null,null,null,"","","",null,"","",null,"",""]
[null,null,null,null,null,null,null,null,null,null,null,null,"","","",null,"","",null,"",""]
[null,null,null,null,null,null,null,null,null,null,null,null,"","","",null,"","",null,"",""]
[null,null,null,null,null,null,null,null,null,null,null,null,"","","",null,"","",null,"",""]
[null,null,null,null,null,null,null,null,null,null,null,null,"","","",null,"","",null,"",""]
[null,null,null,null,null,null,null,null,null,null,null,null,"","","",null,"","",null,"",""]
[null,null,null,null,null,null,null,null,null,null,null,null,"","","",null,"","",null,"",""]
[null,null,null,null,null,null,null,null,null,null,null,null,"","","",null,"","",null,"",""]
[null,null,null,null,null,null,null,null,null,null,null,null,"","","",null,"","",null,"",""]
[null,null,null,null,null,null,null,null,null,null,null,null,"","","",null,"","",null,"",""]
[null,null,null,null,null,null,null,null,null,null,null,null,"","","",null,"","",null,"",""]
[null,null,null,null,null,null,null,null,null,null,null,null,"","","",null,"","",null,"",""]
[null,null,null,null,null,null,null,null,null,null,null,null,"","","",null,"","",null,"",""]
[null,null,null,null,null,null,null,null,null,null,null,null,"","","",null,"","",null,"",""]
[null,null,null,null,null,null,null,null,null,null,null,null,"","","",null,"","",null,"",""]
[null,null,null,null,null,null,null,null,null,null,null,null,"","","",null,"","",null,"",""]
[null,null,null,null,null,null,null,null,null,null,null,null,"","","",null,"","",null,"",""]
[null,null,null,null,null,null,null,null,null,null,null,null,"","","",null,"","",null,"",""]
[null,null,null,null,null,null,null,null,null,null,null,null,"","","",null,"","",null,"",""]
[null,null,null,null,null,null,null,null,null,null,null,null,"","","",null,"","",null,"",""]
[null,null,null,null,null,null,null,null,null,null,null,null,"","","",null,"","",null,"",""]
[null,null,null,null,null,null,null,null,null,null,null,null,"","","",null,"","",null,"",""]
[null,null,null,null,null,null,null,null,null,null,null,null,"","","",null,"","",null,"",""]
[null,null,null,null,null,null,null,null,null,null,null,null,"","","",null,"","",null,"",""]
[null,null,null,null,null,null,null,null,null,null,null,null,"","","",null,"","",null,"",""]
[null,null,null,null,null,null,null,null,null,null,null,null,"","","",null,"","",null,"",""]
[null,null,null,null,null,null,null,null,null,null,null,null,"","","",null,"","",null,"",""]
[null,null,null,null,null,null,null,null,null,null,null,null,"",{"$f":"IF(ISERROR(VLOOKUP($M387,XX_TEJ6,3,FALSE)=TRUE),\"\",VLOOKUP($M387,XX_TEJ6,3,FALSE))","v":""},{"$f":"IF(ISERROR(VLOOKUP($M387,XX_TEJ7,3,FALSE)=TRUE),\"\",VLOOKUP($M387,XX_TEJ7,3,FALSE))","v":""},null,{"$f":"IF(ISERROR(VLOOKUP($M387,XX_TEJ6,4,FALSE)=TRUE),\"\",VLOOKUP($M387,XX_TEJ6,4,FALSE))","v":""},{"$f":"IF(ISERROR(VLOOKUP($M387,XX_TEJ7,4,FALSE)=TRUE),\"\",VLOOKUP($M387,XX_TEJ7,4,FALSE))","v":""},null,{"$f":"IF(ISERROR(VLOOKUP($M387,XX_TEJ6,5,FALSE)=TRUE),\"\",VLOOKUP($M387,XX_TEJ6,5,FALSE))","v":""},{"$f":"IF(ISERROR(VLOOKUP($M387,XX_TEJ7,5,FALSE)=TRUE),\"\",VLOOKUP($M387,XX_TEJ7,5,FALSE))","v":""}]
[null,null,null,null,null,null,null,null,null,null,null,null,{"$f":"IF($A388=\"\",\"\",$A388)","v":""},"","",null,"","",null,"",""]
[null,null,null,null,null,null,null,null,null,null,null,null,"","","",null,"","",null,"",""]
[null,null,null,null,null,null,null,null,null,null,null,null,"","","",null,"","",null,"",""]
[null,null,null,null,null,null,null,null,null,null,null,null,"","","",null,"","",null,"",""]
[null,null,null,null,null,null,null,null,null,null,null,null,"","","",null,"","",null,"",""]
[null,null,null,null,null,null,null,null,null,null,null,null,"","","",null,"","",null,"",""]
[null,null,null,null,null,null,null,null,null,null,null,null,"","","",null,"","",null,"",""]
[null,null,null,null,null,null,null,null,null,null,null,null,"","","",null,"","",null,"",""]
[null,null,null,null,null,null,null,null,null,null,null,null,"","","",null,"","",null,"",""]
[null,null,null,null,null,null,null,null,null,null,null,null,"","","",null,"","",null,"",""]
[null,null,null,null,null,null,null,null,null,null,null,null,"","","",null,"","",null,"",""]
[null,null,null,null,null,null,null,null,null,null,null,null,"","","",null,"","",null,"",""]
[null,null,null,null,null,null,null,null,null,null,null,null,"","","",null,"","",null,"",""]
[null,null,null,null,null,null,null,null,null,null,null,null,"","","",null,"","",null,"",""]
[null,null,null,null,null,null,null,null,null,null,null,null,"","","",null,"","",null,"",""]
[null,null,null,null,null,null,null,null,null,null,null,null,"","","",null,"","",null,"",""]
[null,null,null,null,null,null,null,null,null,null,null,null,"","","",null,"","",null,"",""]
[null,null,null,null,null,null,null,null,null,null,null,null,"","","",null,"","",null,"",""]
[null,null,null,null,null,null,null,null,null,null,null,null,"","","",null,"","",null,"",""]
[null,null,null,null,null,null,null,null,null,null,null,null,"","","",null,"","",null,"",""]
[null,null,null,null,null,null,null,null,null,null,null,null,"","","",null,"","",null,"",""]
[null,null,null,null,null,null,null,null,null,null,null,null,"","","",null,"","",null,"",""]
[null,null,null,null,null,null,null,null,null,null,null,null,"","","",null,"","",null,"",""]
[null,null,null,null,null,null,null,null,null,null,null,null,"","","",null,"","",null,"",""]
[null,null,null,null,null,null,null,null,null,null,null,null,"","","",null,"","",null,"",""]
[null,null,null,null,null,null,null,null,null,null,null,null,"","","",null,"","",null,"",""]
[null,null,null,null,null,null,null,null,null,null,null,null,"","","",null,"","",null,"",""]
[null,null,null,null,null,null,null,null,null,null,null,null,"","","",null,"","",null,"",""]
[null,null,null,null,null,null,null,null,null,null,null,null,"","","",null,"","",null,"",""]
[null,null,null,null,null,null,null,null,null,null,null,null,"","","",null,"","",null,"",""]
[null,null,null,null,null,null,null,null,null,null,null,null,"","","",null,"","",null,"",""]
[null,null,null,null,null,null,null,null,null,null,null,null,"","","",null,"","",null,"",""]
[null,null,null,null,null,null,null,null,null,null,null,null,"","","",null,"","",null,"",""]
[null,null,null,null,null,null,null,null,null,null,null,null,"","","",null,"","",null,"",""]
[null,null,null,null,null,null,null,null,null,null,null,null,"","","",null,"","",null,"",""]
[null,null,null,null,null,null,null,null,null,null,null,null,"","","",null,"","",null,"",""]
[null,null,null,null,null,null,null,null,null,null,null,null,"","","",null,"","",null,"",""]
[null,null,null,null,null,null,null,null,null,null,null,null,"","","",null,"","",null,"",""]
[null,null,null,null,null,null,null,null,null,null,null,null,"","","",null,"","",null,"",""]
[null,null,null,null,null,null,null,null,null,null,null,null,"","","",null,"","",null,"",""]
[null,null,null,null,null,null,null,null,null,null,null,null,"","","",null,"","",null,"",""]
[null,null,null,null,null,null,null,null,null,null,null,null,"","","",null,"","",null,"",""]
[null,null,null,null,null,null,null,null,null,null,null,null,"","","",null,"","",null,"",""]
[null,null,null,null,null,null,null,null,null,null,null,null,"","","",null,"","",null,"",""]
[null,null,null,null,null,null,null,null,null,null,null,null,"","","",null,"","",null,"",""]
[null,null,null,null,null,null,null,null,null,null,null,null,"","","",null,"","",null,"",""]
[null,null,null,null,null,null,null,null,null,null,null,null,"","","",null,"","",null,"",""]
[null,null,null,null,null,null,null,null,null,null,null,null,"","","",null,"","",null,"",""]
[null,null,null,null,null,null,null,null,null,null,null,null,"","","",null,"","",null,"",""]
[null,null,null,null,null,null,null,null,null,null,null,null,"","","",null,"","",null,"",""]
[null,null,null,null,null,null,null,null,null,null,null,null,"","","",null,"","",null,"",""]
[null,null,null,null,null,null,null,null,null,null,null,null,"","","",null,"","",null,"",""]
[null,null,null,null,null,null,null,null,null,null,null,null,"","","",null,"","",null,"",""]
[null,null,null,null,null,null,null,null,null,null,null,null,"","","",null,"","",null,"",""]
[null,null,null,null,null,null,null,null,null,null,null,null,"","","",null,"","",null,"",""]
[null,null,null,null,null,null,null,null,null,null,null,null,"","","",null,"","",null,"",""]
[null,null,null,null,null,null,null,null,null,null,null,null,"","","",null,"","",null,"",""]
[null,null,null,null,null,null,null,null,null,null,null,null,"","","",null,"","",null,"",""]
[null,null,null,null,null,null,null,null,null,null,null,null,"","","",null,"","",null,"",""]
[null,null,null,null,null,null,null,null,null,null,null,null,"","","",null,"","",null,"",""]
[null,null,null,null,null,null,null,null,null,null,null,null,"","","",null,"","",null,"",""]
[null,null,null,null,null,null,null,null,null,null,null,null,"","","",null,"","",null,"",""]
[null,null,null,null,null,null,null,null,null,null,null,null,"","","",null,"","",null,"",""]
[null,null,null,null,null,null,null,null,null,null,null,null,"",{"$f":"IF(ISERROR(VLOOKUP($M451,XX_TEJ6,3,FALSE)=TRUE),\"\",VLOOKUP($M451,XX_TEJ6,3,FALSE))","v":""},{"$f":"IF(ISERROR(VLOOKUP($M451,XX_TEJ7,3,FALSE)=TRUE),\"\",VLOOKUP($M451,XX_TEJ7,3,FALSE))","v":""},null,{"$f":"IF(ISERROR(VLOOKUP($M451,XX_TEJ6,4,FALSE)=TRUE),\"\",VLOOKUP($M451,XX_TEJ6,4,FALSE))","v":""},{"$f":"IF(ISERROR(VLOOKUP($M451,XX_TEJ7,4,FALSE)=TRUE),\"\",VLOOKUP($M451,XX_TEJ7,4,FALSE))","v":""},null,{"$f":"IF(ISERROR(VLOOKUP($M451,XX_TEJ6,5,FALSE)=TRUE),\"\",VLOOKUP($M451,XX_TEJ6,5,FALSE))","v":""},{"$f":"IF(ISERROR(VLOOKUP($M451,XX_TEJ7,5,FALSE)=TRUE),\"\",VLOOKUP($M451,XX_TEJ7,5,FALSE))","v":""}]
[null,null,null,null,null,null,null,null,null,null,null,null,{"$f":"IF($A452=\"\",\"\",$A452)","v":""},"","",null,"","",null,"",""]
[null,null,null,null,null,null,null,null,null,null,null,null,"","","",null,"","",null,"",""]
[null,null,null,null,null,null,null,null,null,null,null,null,"","","",null,"","",null,"",""]
[null,null,null,null,null,null,null,null,null,null,null,null,"","","",null,"","",null,"",""]
[null,null,null,null,null,null,null,null,null,null,null,null,"","","",null,"","",null,"",""]
[null,null,null,null,null,null,null,null,null,null,null,null,"","","",null,"","",null,"",""]
[null,null,null,null,null,null,null,null,null,null,null,null,"","","",null,"","",null,"",""]
[null,null,null,null,null,null,null,null,null,null,null,null,"","","",null,"","",null,"",""]
[null,null,null,null,null,null,null,null,null,null,null,null,"","","",null,"","",null,"",""]
[null,null,null,null,null,null,null,null,null,null,null,null,"","","",null,"","",null,"",""]
[null,null,null,null,null,null,null,null,null,null,null,null,"","","",null,"","",null,"",""]
[null,null,null,null,null,null,null,null,null,null,null,null,"","","",null,"","",null,"",""]
[null,null,null,null,null,null,null,null,null,null,null,null,"","","",null,"","",null,"",""]
[null,null,null,null,null,null,null,null,null,null,null,null,"","","",null,"","",null,"",""]
[null,null,null,null,null,null,null,null,null,null,null,null,"","","",null,"","",null,"",""]
[null,null,null,null,null,null,null,null,null,null,null,null,"","","",null,"","",null,"",""]
[null,null,null,null,null,null,null,null,null,null,null,null,"","","",null,"","",null,"",""]
[null,null,null,null,null,null,null,null,null,null,null,null,"","","",null,"","",null,"",""]
[null,null,null,null,null,null,null,null,null,null,null,null,"","","",null,"","",null,"",""]
[null,null,null,null,null,null,null,null,null,null,null,null,"","","",null,"","",null,"",""]
[null,null,null,null,null,null,null,null,null,null,null,null,"","","",null,"","",null,"",""]
[null,null,null,null,null,null,null,null,null,null,null,null,"","","",null,"","",null,"",""]
[null,null,null,null,null,null,null,null,null,null,null,null,"","","",null,"","",null,"",""]
[null,null,null,null,null,null,null,null,null,null,null,null,"","","",null,"","",null,"",""]
[null,null,null,null,null,null,null,null,null,null,null,null,"","","",null,"","",null,"",""]
[null,null,null,null,null,null,null,null,null,null,null,null,"","","",null,"","",null,"",""]
[null,null,null,null,null,null,null,null,null,null,null,null,"","","",null,"","",null,"",""]
[null,null,null,null,null,null,null,null,null,null,null,null,"","","",null,"","",null,"",""]
[null,null,null,null,null,null,null,null,null,null,null,null,"","","",null,"","",null,"",""]
[null,null,null,null,null,null,null,null,null,null,null,null,"","","",null,"","",null,"",""]
[null,null,null,null,null,null,null,null,null,null,null,null,"","","",null,"","",null,"",""]
[null,null,null,null,null,null,null,null,null,null,null,null,"","","",null,"","",null,"",""]
[null,null,null,null,null,null,null,null,null,null,null,null,"","","",null,"","",null,"",""]
[null,null,null,null,null,null,null,null,null,null,null,null,"","","",null,"","",null,"",""]
[null,null,null,null,null,null,null,null,null,null,null,null,"","","",null,"","",null,"",""]
[null,null,null,null,null,null,null,null,null,null,null,null,"","","",null,"","",null,"",""]
[null,null,null,null,null,null,null,null,null,null,null,null,"","","",null,"","",null,"",""]
[null,null,null,null,null,null,null,null,null,null,null,null,"","","",null,"","",null,"",""]
[null,null,null,null,null,null,null,null,null,null,null,null,"","","",null,"","",null,"",""]
[null,null,null,null,null,null,null,null,null,null,null,null,"","","",null,"","",null,"",""]
[null,null,null,null,null,null,null,null,null,null,null,null,"","","",null,"","",null,"",""]
[null,null,null,null,null,null,null,null,null,null,null,null,"","","",null,"","",null,"",""]
[null,null,null,null,null,null,null,null,null,null,null,null,"","","",null,"","",null,"",""]
[null,null,null,null,null,null,null,null,null,null,null,null,"","","",null,"","",null,"",""]
[null,null,null,null,null,null,null,null,null,null,null,null,"","","",null,"","",null,"",""]
[null,null,null,null,null,null,null,null,null,null,null,null,"","","",null,"","",null,"",""]
[null,null,null,null,null,null,null,null,null,null,null,null,"","","",null,"","",null,"",""]
[null,null,null,null,null,null,null,null,null,null,null,null,"","","",null,"","",null,"",""]
[null,null,null,null,null,null,null,null,null,null,null,null,"","","",null,"","",null,"",""]
[null,null,null,null,null,null,null,null,null,null,null,null,"","","",null,"","",null,"",""]
[null,null,null,null,null,null,null,null,null,null,null,null,"","","",null,"","",null,"",""]
[null,null,null,null,null,null,null,null,null,null,null,null,"","","",null,"","",null,"",""]
[null,null,null,null,null,null,null,null,null,null,null,null,"","","",null,"","",null,"",""]
[null,null,null,null,null,null,null,null,null,null,null,null,"","","",null,"","",null,"",""]
[null,null,null,null,null,null,null,null,null,null,null,null,"","","",null,"","",null,"",""]
[null,null,null,null,null,null,null,null,null,null,null,null,"","","",null,"","",null,"",""]
[null,null,null,null,null,null,null,null,null,null,null,null,"","","",null,"","",null,"",""]
[null,null,null,null,null,null,null,null,null,null,null,null,"","","",null,"","",null,"",""]
[null,null,null,null,null,null,null,null,null,null,null,null,"","","",null,"","",null,"",""]
[null,null,null,null,null,null,null,null,null,null,null,null,"","","",null,"","",null,"",""]
[null,null,null,null,null,null,null,null,null,null,null,null,"","","",null,"","",null,"",""]
[null,null,null,null,null,null,null,null,null,null,null,null,"","","",null,"","",null,"",""]
[null,null,null,null,null,null,null,null,null,null,null,null,"","","",null,"","",null,"",""]
[null,null,null,null,null,null,null,null,null,null,null,null,"",{"$f":"IF(ISERROR(VLOOKUP($M515,XX_TEJ6,3,FALSE)=TRUE),\"\",VLOOKUP($M515,XX_TEJ6,3,FALSE))","v":""},{"$f":"IF(ISERROR(VLOOKUP($M515,XX_TEJ7,3,FALSE)=TRUE),\"\",VLOOKUP($M515,XX_TEJ7,3,FALSE))","v":""},null,{"$f":"IF(ISERROR(VLOOKUP($M515,XX_TEJ6,4,FALSE)=TRUE),\"\",VLOOKUP($M515,XX_TEJ6,4,FALSE))","v":""},{"$f":"IF(ISERROR(VLOOKUP($M515,XX_TEJ7,4,FALSE)=TRUE),\"\",VLOOKUP($M515,XX_TEJ7,4,FALSE))","v":""},null,{"$f":"IF(ISERROR(VLOOKUP($M515,XX_TEJ6,5,FALSE)=TRUE),\"\",VLOOKUP($M515,XX_TEJ6,5,FALSE))","v":""},{"$f":"IF(ISERROR(VLOOKUP($M515,XX_TEJ7,5,FALSE)=TRUE),\"\",VLOOKUP($M515,XX_TEJ7,5,FALSE))","v":""}]
[null,null,null,null,null,null,null,null,null,null,null,null,{"$f":"IF($A516=\"\",\"\",$A516)","v":""},"","",null,"","",null,"",""]
[null,null,null,null,null,null,null,null,null,null,null,null,"","","",null,"","",null,"",""]
[null,null,null,null,null,null,null,null,null,null,null,null,"","","",null,"","",null,"",""]
[null,null,null,null,null,null,null,null,null,null,null,null,"","","",null,"","",null,"",""]
[null,null,null,null,null,null,null,null,null,null,null,null,"","","",null,"","",null,"",""]
[null,null,null,null,null,null,null,null,null,null,null,null,"","","",null,"","",null,"",""]
[null,null,null,null,null,null,null,null,null,null,null,null,"","","",null,"","",null,"",""]
[null,null,null,null,null,null,null,null,null,null,null,null,"","","",null,"","",null,"",""]
[null,null,null,null,null,null,null,null,null,null,null,null,"","","",null,"","",null,"",""]
[null,null,null,null,null,null,null,null,null,null,null,null,"","","",null,"","",null,"",""]
[null,null,null,null,null,null,null,null,null,null,null,null,"","","",null,"","",null,"",""]
[null,null,null,null,null,null,null,null,null,null,null,null,"","","",null,"","",null,"",""]
[null,null,null,null,null,null,null,null,null,null,null,null,"","","",null,"","",null,"",""]
[null,null,null,null,null,null,null,null,null,null,null,null,"","","",null,"","",null,"",""]
[null,null,null,null,null,null,null,null,null,null,null,null,"","","",null,"","",null,"",""]
[null,null,null,null,null,null,null,null,null,null,null,null,"","","",null,"","",null,"",""]
[null,null,null,null,null,null,null,null,null,null,null,null,"","","",null,"","",null,"",""]
[null,null,null,null,null,null,null,null,null,null,null,null,"","","",null,"","",null,"",""]
[null,null,null,null,null,null,null,null,null,null,null,null,"","","",null,"","",null,"",""]
[null,null,null,null,null,null,null,null,null,null,null,null,"","","",null,"","",null,"",""]
[null,null,null,null,null,null,null,null,null,null,null,null,"","","",null,"","",null,"",""]
[null,null,null,null,null,null,null,null,null,null,null,null,"","","",null,"","",null,"",""]
[null,null,null,null,null,null,null,null,null,null,null,null,"","","",null,"","",null,"",""]
[null,null,null,null,null,null,null,null,null,null,null,null,"","","",null,"","",null,"",""]
[null,null,null,null,null,null,null,null,null,null,null,null,"","","",null,"","",null,"",""]
[null,null,null,null,null,null,null,null,null,null,null,null,"","","",null,"","",null,"",""]
[null,null,null,null,null,null,null,null,null,null,null,null,"","","",null,"","",null,"",""]
[null,null,null,null,null,null,null,null,null,null,null,null,"","","",null,"","",null,"",""]
[null,null,null,null,null,null,null,null,null,null,null,null,"","","",null,"","",null,"",""]
[null,null,null,null,null,null,null,null,null,null,null,null,"","","",null,"","",null,"",""]
[null,null,null,null,null,null,null,null,null,null,null,null,"","","",null,"","",null,"",""]
[null,null,null,null,null,null,null,null,null,null,null,null,"","","",null,"","",null,"",""]
[null,null,null,null,null,null,null,null,null,null,null,null,"","","",null,"","",null,"",""]
[null,null,null,null,null,null,null,null,null,null,null,null,"","","",null,"","",null,"",""]
[null,null,null,null,null,null,null,null,null,null,null,null,"","","",null,"","",null,"",""]
[null,null,null,null,null,null,null,null,null,null,null,null,"","","",null,"","",null,"",""]
[null,null,null,null,null,null,null,null,null,null,null,null,"","","",null,"","",null,"",""]
[null,null,null,null,null,null,null,null,null,null,null,null,"","","",null,"","",null,"",""]
[null,null,null,null,null,null,null,null,null,null,null,null,"","","",null,"","",null,"",""]
[null,null,null,null,null,null,null,null,null,null,null,null,"","","",null,"","",null,"",""]
[null,null,null,null,null,null,null,null,null,null,null,null,"","","",null,"","",null,"",""]
[null,null,null,null,null,null,null,null,null,null,null,null,"","","",null,"","",null,"",""]
[null,null,null,null,null,null,null,null,null,null,null,null,"","","",null,"","",null,"",""]
[null,null,null,null,null,null,null,null,null,null,null,null,"","","",null,"","",null,"",""]
[null,null,null,null,null,null,null,null,null,null,null,null,"","","",null,"","",null,"",""]
[null,null,null,null,null,null,null,null,null,null,null,null,"","","",null,"","",null,"",""]
[null,null,null,null,null,null,null,null,null,null,null,null,"","","",null,"","",null,"",""]
[null,null,null,null,null,null,null,null,null,null,null,null,"","","",null,"","",null,"",""]
[null,null,null,null,null,null,null,null,null,null,null,null,"","","",null,"","",null,"",""]
[null,null,null,null,null,null,null,null,null,null,null,null,"","","",null,"","",null,"",""]
[null,null,null,null,null,null,null,null,null,null,null,null,"","","",null,"","",null,"",""]
[null,null,null,null,null,null,null,null,null,null,null,null,"","","",null,"","",null,"",""]
[null,null,null,null,null,null,null,null,null,null,null,null,"","","",null,"","",null,"",""]
[null,null,null,null,null,null,null,null,null,null,null,null,"","","",null,"","",null,"",""]
[null,null,null,null,null,null,null,null,null,null,null,null,"","","",null,"","",null,"",""]
[null,null,null,null,null,null,null,null,null,null,null,null,"","","",null,"","",null,"",""]
[null,null,null,null,null,null,null,null,null,null,null,null,"","","",null,"","",null,"",""]
[null,null,null,null,null,null,null,null,null,null,null,null,"","","",null,"","",null,"",""]
[null,null,null,null,null,null,null,null,null,null,null,null,"","","",null,"","",null,"",""]
[null,null,null,null,null,null,null,null,null,null,null,null,"","","",null,"","",null,"",""]
[null,null,null,null,null,null,null,null,null,null,null,null,"","","",null,"","",null,"",""]
[null,null,null,null,null,null,null,null,null,null,null,null,"","","",null,"","",null,"",""]
[null,null,null,null,null,null,null,null,null,null,null,null,"","","",null,"","",null,"",""]
[null,null,null,null,null,null,null,null,null,null,null,null,"",{"$f":"IF(ISERROR(VLOOKUP($M579,XX_TEJ6,3,FALSE)=TRUE),\"\",VLOOKUP($M579,XX_TEJ6,3,FALSE))","v":""},{"$f":"IF(ISERROR(VLOOKUP($M579,XX_TEJ7,3,FALSE)=TRUE),\"\",VLOOKUP($M579,XX_TEJ7,3,FALSE))","v":""},null,{"$f":"IF(ISERROR(VLOOKUP($M579,XX_TEJ6,4,FALSE)=TRUE),\"\",VLOOKUP($M579,XX_TEJ6,4,FALSE))","v":""},{"$f":"IF(ISERROR(VLOOKUP($M579,XX_TEJ7,4,FALSE)=TRUE),\"\",VLOOKUP($M579,XX_TEJ7,4,FALSE))","v":""},null,{"$f":"IF(ISERROR(VLOOKUP($M579,XX_TEJ6,5,FALSE)=TRUE),\"\",VLOOKUP($M579,XX_TEJ6,5,FALSE))","v":""},{"$f":"IF(ISERROR(VLOOKUP($M579,XX_TEJ7,5,FALSE)=TRUE),\"\",VLOOKUP($M579,XX_TEJ7,5,FALSE))","v":""}]
[null,null,null,null,null,null,null,null,null,null,null,null,{"$f":"IF($A580=\"\",\"\",$A580)","v":""},"","",null,"","",null,"",""]
[null,null,null,null,null,null,null,null,null,null,null,null,"","","",null,"","",null,"",""]
[null,null,null,null,null,null,null,null,null,null,null,null,"","","",null,"","",null,"",""]
[null,null,null,null,null,null,null,null,null,null,null,null,"","","",null,"","",null,"",""]
[null,null,null,null,null,null,null,null,null,null,null,null,"","","",null,"","",null,"",""]
[null,null,null,null,null,null,null,null,null,null,null,null,"","","",null,"","",null,"",""]
[null,null,null,null,null,null,null,null,null,null,null,null,"","","",null,"","",null,"",""]
[null,null,null,null,null,null,null,null,null,null,null,null,"","","",null,"","",null,"",""]
[null,null,null,null,null,null,null,null,null,null,null,null,"","","",null,"","",null,"",""]
[null,null,null,null,null,null,null,null,null,null,null,null,"","","",null,"","",null,"",""]
[null,null,null,null,null,null,null,null,null,null,null,null,"","","",null,"","",null,"",""]
[null,null,null,null,null,null,null,null,null,null,null,null,"","","",null,"","",null,"",""]
[null,null,null,null,null,null,null,null,null,null,null,null,"","","",null,"","",null,"",""]
[null,null,null,null,null,null,null,null,null,null,null,null,"","","",null,"","",null,"",""]
[null,null,null,null,null,null,null,null,null,null,null,null,"","","",null,"","",null,"",""]
[null,null,null,null,null,null,null,null,null,null,null,null,"","","",null,"","",null,"",""]
[null,null,null,null,null,null,null,null,null,null,null,null,"","","",null,"","",null,"",""]
[null,null,null,null,null,null,null,null,null,null,null,null,"","","",null,"","",null,"",""]
[null,null,null,null,null,null,null,null,null,null,null,null,"","","",null,"","",null,"",""]
[null,null,null,null,null,null,null,null,null,null,null,null,"","","",null,"","",null,"",""]
[null,null,null,null,null,null,null,null,null,null,null,null,"","","",null,"","",null,"",""]
[null,null,null,null,null,null,null,null,null,null,null,null,"","","",null,"","",null,"",""]
[null,null,null,null,null,null,null,null,null,null,null,null,"","","",null,"","",null,"",""]
[null,null,null,null,null,null,null,null,null,null,null,null,"","","",null,"","",null,"",""]
[null,null,null,null,null,null,null,null,null,null,null,null,"","","",null,"","",null,"",""]
[null,null,null,null,null,null,null,null,null,null,null,null,"","","",null,"","",null,"",""]
[null,null,null,null,null,null,null,null,null,null,null,null,"","","",null,"","",null,"",""]
[null,null,null,null,null,null,null,null,null,null,null,null,"","","",null,"","",null,"",""]
[null,null,null,null,null,null,null,null,null,null,null,null,"","","",null,"","",null,"",""]
[null,null,null,null,null,null,null,null,null,null,null,null,"","","",null,"","",null,"",""]
[null,null,null,null,null,null,null,null,null,null,null,null,"","","",null,"","",null,"",""]
[null,null,null,null,null,null,null,null,null,null,null,null,"","","",null,"","",null,"",""]
[null,null,null,null,null,null,null,null,null,null,null,null,"","","",null,"","",null,"",""]
[null,null,null,null,null,null,null,null,null,null,null,null,"","","",null,"","",null,"",""]
[null,null,null,null,null,null,null,null,null,null,null,null,"","","",null,"","",null,"",""]
[null,null,null,null,null,null,null,null,null,null,null,null,"","","",null,"","",null,"",""]
[null,null,null,null,null,null,null,null,null,null,null,null,"","","",null,"","",null,"",""]
[null,null,null,null,null,null,null,null,null,null,null,null,"","","",null,"","",null,"",""]
[null,null,null,null,null,null,null,null,null,null,null,null,"","","",null,"","",null,"",""]
[null,null,null,null,null,null,null,null,null,null,null,null,"","","",null,"","",null,"",""]
[null,null,null,null,null,null,null,null,null,null,null,null,"","","",null,"","",null,"",""]
[null,null,null,null,null,null,null,null,null,null,null,null,"","","",null,"","",null,"",""]
[null,null,null,null,null,null,null,null,null,null,null,null,"","","",null,"","",null,"",""]
[null,null,null,null,null,null,null,null,null,null,null,null,"","","",null,"","",null,"",""]
[null,null,null,null,null,null,null,null,null,null,null,null,"","","",null,"","",null,"",""]
[null,null,null,null,null,null,null,null,null,null,null,null,"","","",null,"","",null,"",""]
[null,null,null,null,null,null,null,null,null,null,null,null,"","","",null,"","",null,"",""]
[null,null,null,null,null,null,null,null,null,null,null,null,"","","",null,"","",null,"",""]
[null,null,null,null,null,null,null,null,null,null,null,null,"","","",null,"","",null,"",""]
[null,null,null,null,null,null,null,null,null,null,null,null,"","","",null,"","",null,"",""]
[null,null,null,null,null,null,null,null,null,null,null,null,"","","",null,"","",null,"",""]
[null,null,null,null,null,null,null,null,null,null,null,null,"","","",null,"","",null,"",""]
[null,null,null,null,null,null,null,null,null,null,null,null,"","","",null,"","",null,"",""]
[null,null,null,null,null,null,null,null,null,null,null,null,"","","",null,"","",null,"",""]
[null,null,null,null,null,null,null,null,null,null,null,null,"","","",null,"","",null,"",""]
[null,null,null,null,null,null,null,null,null,null,null,null,"","","",null,"","",null,"",""]
[null,null,null,null,null,null,null,null,null,null,null,null,"","","",null,"","",null,"",""]
[null,null,null,null,null,null,null,null,null,null,null,null,"","","",null,"","",null,"",""]
[null,null,null,null,null,null,null,null,null,null,null,null,"","","",null,"","",null,"",""]
[null,null,null,null,null,null,null,null,null,null,null,null,"","","",null,"","",null,"",""]
[null,null,null,null,null,null,null,null,null,null,null,null,"","","",null,"","",null,"",""]
[null,null,null,null,null,null,null,null,null,null,null,null,"","","",null,"","",null,"",""]
[null,null,null,null,null,null,null,null,null,null,null,null,"","","",null,"","",null,"",""]
[null,null,null,null,null,null,null,null,null,null,null,null,"",{"$f":"IF(ISERROR(VLOOKUP($M643,XX_TEJ6,3,FALSE)=TRUE),\"\",VLOOKUP($M643,XX_TEJ6,3,FALSE))","v":""},{"$f":"IF(ISERROR(VLOOKUP($M643,XX_TEJ7,3,FALSE)=TRUE),\"\",VLOOKUP($M643,XX_TEJ7,3,FALSE))","v":""},null,{"$f":"IF(ISERROR(VLOOKUP($M643,XX_TEJ6,4,FALSE)=TRUE),\"\",VLOOKUP($M643,XX_TEJ6,4,FALSE))","v":""},{"$f":"IF(ISERROR(VLOOKUP($M643,XX_TEJ7,4,FALSE)=TRUE),\"\",VLOOKUP($M643,XX_TEJ7,4,FALSE))","v":""},null,{"$f":"IF(ISERROR(VLOOKUP($M643,XX_TEJ6,5,FALSE)=TRUE),\"\",VLOOKUP($M643,XX_TEJ6,5,FALSE))","v":""},{"$f":"IF(ISERROR(VLOOKUP($M643,XX_TEJ7,5,FALSE)=TRUE),\"\",VLOOKUP($M643,XX_TEJ7,5,FALSE))","v":""}]
[null,null,null,null,null,null,null,null,null,null,null,null,{"$f":"IF($A644=\"\",\"\",$A644)","v":""},"","",null,"","",null,"",""]
[null,null,null,null,null,null,null,null,null,null,null,null,"","","",null,"","",null,"",""]
[null,null,null,null,null,null,null,null,null,null,null,null,"","","",null,"","",null,"",""]
[null,null,null,null,null,null,null,null,null,null,null,null,"","","",null,"","",null,"",""]
[null,null,null,null,null,null,null,null,null,null,null,null,"","","",null,"","",null,"",""]
[null,null,null,null,null,null,null,null,null,null,null,null,"","","",null,"","",null,"",""]
[null,null,null,null,null,null,null,null,null,null,null,null,"","","",null,"","",null,"",""]
[null,null,null,null,null,null,null,null,null,null,null,null,"","","",null,"","",null,"",""]
[null,null,null,null,null,null,null,null,null,null,null,null,"","","",null,"","",null,"",""]
[null,null,null,null,null,null,null,null,null,null,null,null,"","","",null,"","",null,"",""]
[null,null,null,null,null,null,null,null,null,null,null,null,"","","",null,"","",null,"",""]
[null,null,null,null,null,null,null,null,null,null,null,null,"","","",null,"","",null,"",""]
[null,null,null,null,null,null,null,null,null,null,null,null,"","","",null,"","",null,"",""]
[null,null,null,null,null,null,null,null,null,null,null,null,"","","",null,"","",null,"",""]
[null,null,null,null,null,null,null,null,null,null,null,null,"","","",null,"","",null,"",""]
[null,null,null,null,null,null,null,null,null,null,null,null,"","","",null,"","",null,"",""]
[null,null,null,null,null,null,null,null,null,null,null,null,"","","",null,"","",null,"",""]
[null,null,null,null,null,null,null,null,null,null,null,null,"","","",null,"","",null,"",""]
[null,null,null,null,null,null,null,null,null,null,null,null,"","","",null,"","",null,"",""]
[null,null,null,null,null,null,null,null,null,null,null,null,"","","",null,"","",null,"",""]
[null,null,null,null,null,null,null,null,null,null,null,null,"","","",null,"","",null,"",""]
[null,null,null,null,null,null,null,null,null,null,null,null,"","","",null,"","",null,"",""]
[null,null,null,null,null,null,null,null,null,null,null,null,"","","",null,"","",null,"",""]
[null,null,null,null,null,null,null,null,null,null,null,null,"","","",null,"","",null,"",""]
[null,null,null,null,null,null,null,null,null,null,null,null,"","","",null,"","",null,"",""]
[null,null,null,null,null,null,null,null,null,null,null,null,"","","",null,"","",null,"",""]
[null,null,null,null,null,null,null,null,null,null,null,null,"","","",null,"","",null,"",""]
[null,null,null,null,null,null,null,null,null,null,null,null,"","","",null,"","",null,"",""]
[null,null,null,null,null,null,null,null,null,null,null,null,"","","",null,"","",null,"",""]
[null,null,null,null,null,null,null,null,null,null,null,null,"","","",null,"","",null,"",""]
[null,null,null,null,null,null,null,null,null,null,null,null,"","","",null,"","",null,"",""]
[null,null,null,null,null,null,null,null,null,null,null,null,"","","",null,"","",null,"",""]
[null,null,null,null,null,null,null,null,null,null,null,null,"","","",null,"","",null,"",""]
[null,null,null,null,null,null,null,null,null,null,null,null,"","","",null,"","",null,"",""]
[null,null,null,null,null,null,null,null,null,null,null,null,"","","",null,"","",null,"",""]
[null,null,null,null,null,null,null,null,null,null,null,null,"","","",null,"","",null,"",""]
[null,null,null,null,null,null,null,null,null,null,null,null,"","","",null,"","",null,"",""]
[null,null,null,null,null,null,null,null,null,null,null,null,"","","",null,"","",null,"",""]
[null,null,null,null,null,null,null,null,null,null,null,null,"","","",null,"","",null,"",""]
[null,null,null,null,null,null,null,null,null,null,null,null,"","","",null,"","",null,"",""]
[null,null,null,null,null,null,null,null,null,null,null,null,"","","",null,"","",null,"",""]
[null,null,null,null,null,null,null,null,null,null,null,null,"","","",null,"","",null,"",""]
[null,null,null,null,null,null,null,null,null,null,null,null,"","","",null,"","",null,"",""]
[null,null,null,null,null,null,null,null,null,null,null,null,"","","",null,"","",null,"",""]
[null,null,null,null,null,null,null,null,null,null,null,null,"","","",null,"","",null,"",""]
[null,null,null,null,null,null,null,null,null,null,null,null,"","","",null,"","",null,"",""]
[null,null,null,null,null,null,null,null,null,null,null,null,"","","",null,"","",null,"",""]
[null,null,null,null,null,null,null,null,null,null,null,null,"","","",null,"","",null,"",""]
[null,null,null,null,null,null,null,null,null,null,null,null,"","","",null,"","",null,"",""]
[null,null,null,null,null,null,null,null,null,null,null,null,"","","",null,"","",null,"",""]
[null,null,null,null,null,null,null,null,null,null,null,null,"","","",null,"","",null,"",""]
[null,null,null,null,null,null,null,null,null,null,null,null,"","","",null,"","",null,"",""]
[null,null,null,null,null,null,null,null,null,null,null,null,"","","",null,"","",null,"",""]
[null,null,null,null,null,null,null,null,null,null,null,null,"","","",null,"","",null,"",""]
[null,null,null,null,null,null,null,null,null,null,null,null,"","","",null,"","",null,"",""]
[null,null,null,null,null,null,null,null,null,null,null,null,"","","",null,"","",null,"",""]
[null,null,null,null,null,null,null,null,null,null,null,null,"","","",null,"","",null,"",""]
[null,null,null,null,null,null,null,null,null,null,null,null,"","","",null,"","",null,"",""]
[null,null,null,null,null,null,null,null,null,null,null,null,"","","",null,"","",null,"",""]
[null,null,null,null,null,null,null,null,null,null,null,null,"","","",null,"","",null,"",""]
[null,null,null,null,null,null,null,null,null,null,null,null,"","","",null,"","",null,"",""]
[null,null,null,null,null,null,null,null,null,null,null,null,"","","",null,"","",null,"",""]