{"text_format":"1","workbook":"xlsx","n_sheets":8,"sheets":["基金綜合報表","基金屬性","淨值及報酬","風險控管","基金PROFILE","投資組合-個股別","投資組合-產品別","圖型"],"not_rendered":{"charts":4,"images":0,"macros":1,"external_links":0,"defined_names":19,"comments":7,"pivot_tables":0},"unopened":[],"bounds":{"document_bytes":16777216,"sheet_cells":100000,"rows_first":2000,"rows_last":500,"rows_between":2000,"halvings":0,"cell_chars":16384,"cell_head_chars":4096},"cells_cut":0,"cells_raw":0,"read":"whole","date_system":"1900"}

{"sheet":"基金綜合報表","index":0,"n_rows":73,"n_cols":15,"rows_kept":73,"cut":false,"hidden":false,"merged":[[11,1,11,2],[13,7,13,8],[13,1,13,2],[13,3,13,4],[14,7,14,8],[14,3,14,4],[11,5,11,6],[12,5,12,6],[13,5,13,6],[12,3,12,4],[11,3,11,4],[45,0,45,4],[13,9,13,11],[17,0,18,1],[14,1,14,2],[16,0,16,4],[1,13,1,14],[2,1,2,2],[2,4,2,6],[14,9,14,11],[3,5,3,11],[8,1,8,6],[8,8,8,11],[10,5,10,6],[11,7,11,8],[12,1,12,2],[4,4,4,6],[5,1,5,6],[14,5,14,6],[10,7,10,8],[12,7,12,8],[9,7,9,8],[7,1,7,2],[2,8,2,11],[3,1,3,4],[10,1,10,2],[1,0,1,11],[4,1,4,3],[9,1,9,2],[9,5,9,6],[10,3,10,4],[7,4,7,5],[7,9,7,10],[6,3,6,4],[6,5,6,6],[9,9,9,10],[5,13,5,14],[10,13,10,14],[10,9,10,11],[11,9,11,11],[12,9,12,11]]}
["00878","<<請輸入欲查詢的基金代碼(英文字請輸入大寫)，然後按[REFRESH]更新版面"]
["基金基本資料",null,null,null,null,null,null,null,null,null,null,null,null,"風險控管"]
["　基金代碼",{"$f":"LEFT(基金屬性!A1,FIND(\" \",基金屬性!A1))","v":"00878 "},null,"基金簡稱",{"$f":"MID(基金屬性!A1,FIND(\" \",基金屬性!A1)+1,10)","v":"國泰永續高股息"},null,null,"統    編",{"$f":"RIGHT(REPT(0,8)&基金屬性!A3,8)","v":"88090913"},null,null,null,null,"資料日期",{"$f":"TEXT(淨值及報酬!B2,\"YYYY/MM/DD\")","v":"2024/10/30"}]
["　中/英文名稱",{"$f":"基金屬性!B3","v":"國泰台灣高股息傘型證券投資信託基金之台灣ESG永續高股息ETF證券投資信託基金"},null,null,null,{"$f":"基金屬性!C3","v":"Cathay MSCI Taiwan ESG Sustainability High Dividend Yield ETF"},null,null,null,null,null,null,null,"淨值(元)",{"$f":"淨值及報酬!B3","v":22.75}]
["　現任基金經理人",{"$f":"IF(基金屬性!D3=\"\",\"\",基金屬性!D3)","v":"游日傑(2021/03/01到任)"},null,null,{"$f":"IF(基金屬性!E3=\"\",\"\",基金屬性!E3)","v":""},null,null,"經理費",{"$f":"IF(基金屬性!O3=\"\",\"\",基金屬性!O3)","v":0.25},"~",{"$f":"IF(基金屬性!N3=\"\",\"\",基金屬性!N3)","v":0.3},"%",null,"日報酬率%",{"$f":"淨值及報酬!B4","v":-0.56818199999999996}]
["　基金類型",{"$f":"IF(基金屬性!F3=\"\",\"\",基金屬性!F3)","v":"國內指數-一般ETF"},null,null,null,null,null,"保管費",{"$f":"IF(基金屬性!Q3=\"\",\"\",基金屬性!Q3)","v":""},"~",{"$f":"IF(基金屬性!P3=\"\",\"\",基金屬性!P3)","v":0.03},"%",null,"12個月"]
["　傘狀基金",{"$f":"基金屬性!G3","v":"Y"},"成員",{"$f":"IF($B$7=\"N\",\"\",基金屬性!H3)","v":"T3786A 國泰台灣高股息傘型證券投資信託基金之台灣高股息證券投資信託基金 A類型新臺幣"},null,{"$f":"IF($B$7=\"N\",\"\",基金屬性!I3)","v":0},null,"銷售費",{"$f":"IF(基金屬性!S3=\"\",\"\",基金屬性!S3)","v":0},"~",{"$f":"IF(基金屬性!R3=\"\",\"\",基金屬性!R3)","v":2},"%",null,"年化標準差",{"$f":"IF(風險控管!B3=\"\",IF(風險控管!C3=\"\",\"\",風險控管!C3),風險控管!B3)","v":13.2646}]
["　成立資產",{"$f":"基金屬性!J3","v":6769050},null,"(千元)",{"$f":"TEXT(基金屬性!K3,\"YYYY/MM/DD\")","v":"2020/07/10"},null,"成立","贖回費","每筆",{"$f":"IF(基金屬性!T3=\"\",\"\",基金屬性!T3)","v":0},null,"元",null,"BETA值",{"$f":"IF(風險控管!B4=\"\",IF(風險控管!C4=\"\",\"\",風險控管!C4),風險控管!B4)","v":0.75180000000000002}]
["　型        態",{"$f":"基金屬性!L3","v":"國內募集,投資國內"},null,null,null,null,null,"標    的",{"$f":"基金屬性!M3","v":"ETF"},null,null,null,null,"SHARPE值",{"$f":"IF(風險控管!B5=\"\",IF(風險控管!C5=\"\",\"\",風險控管!C5),風險控管!B5)","v":0.50690000000000002}]
["　基金淨資產",{"$f":"淨值及報酬!E3","v":323292924},null,"(千元)   資料時間",null,{"$f":"TEXT(淨值及報酬!E2,\"YYYY/MM/DD\")","v":"2024/09/30"},null," 受益人大會費用",null,{"$f":"IF(基金屬性!U3=\"\",\"\",基金屬性!U3)","v":100},null,"萬元",null,"IR值",{"$f":"IF(風險控管!B6=\"\",IF(風險控管!C6=\"\",\"\",風險控管!C6),風險控管!B6)","v":-0.2014}]
[null,"ㄧ個月",null,"三個月",null,"六個月",null,"ㄧ年",null,"三年",null,null,null,"24個月"]
["同類基金排名",{"$f":"IF(基金PROFILE!B3=\"\",\"\",基金PROFILE!B3)&\"/\"&IF(基金PROFILE!C3=\"\",\"\",基金PROFILE!C3)","v":"27/55"},null,{"$f":"IF(基金PROFILE!D3=\"\",\"\",基金PROFILE!D3)&\"/\"&IF(基金PROFILE!E3=\"\",\"\",基金PROFILE!E3)","v":"29/54"},null,{"$f":"IF(基金PROFILE!F3=\"\",\"\",基金PROFILE!F3)&\"/\"&IF(基金PROFILE!G3=\"\",\"\",基金PROFILE!G3)","v":"30/52"},null,{"$f":"IF(基金PROFILE!H3=\"\",\"\",基金PROFILE!H3)&\"/\"&IF(基金PROFILE!I3=\"\",\"\",基金PROFILE!I3)","v":"38/48"},null,{"$f":"IF(基金PROFILE!J3=\"\",\"\",基金PROFILE!J3)&\"/\"&IF(基金PROFILE!K3=\"\",\"\",基金PROFILE!K3)","v":"11/27"},null,null,null,"年化標準差",{"$f":"IF(風險控管!B7=\"\",IF(風險控管!C7=\"\",\"\",風險控管!C7),風險控管!B7)","v":15.904199999999999}]
["報酬率%",{"$f":"IF(基金PROFILE!B6=\"\",\"\",基金PROFILE!B6)","v":1.021315},null,{"$f":"IF(基金PROFILE!C6=\"\",\"\",基金PROFILE!C6)","v":1.648911},null,{"$f":"IF(基金PROFILE!D6=\"\",\"\",基金PROFILE!D6)","v":7.4697930000000001},null,{"$f":"IF(基金PROFILE!E6=\"\",\"\",基金PROFILE!E6)","v":25.217426},null,{"$f":"IF(基金PROFILE!F6=\"\",\"\",基金PROFILE!F6)","v":53.820667},null,null,null,"BETA值",{"$f":"IF(風險控管!B8=\"\",IF(風險控管!C8=\"\",\"\",風險控管!C8),風險控管!B8)","v":0.68410000000000004}]
[null,null,null,null,null,null,null,null,null,null,null,null,null,"SHARPE值",{"$f":"IF(風險控管!B9=\"\",IF(風險控管!C9=\"\",\"\",風險控管!C9),風險控管!B9)","v":0.4672}]
[null,null,null,null,null,null,null,null,null,null,null,null,null,"IR值",{"$f":"IF(風險控管!B10=\"\",IF(風險控管!C10=\"\",\"\",風險控管!C10),風險控管!B10)","v":-0.15939999999999999}]
[]
["基金投資組合－產業別"]
["產業別",null,"投資率","比上月","比重"]
[null,null,"%","增減%","排名"]
[{"$f":"IF(OR('投資組合-產品別'!$B3=\"\",'投資組合-產品別'!$B3=0),\"\",'投資組合-產品別'!$A3)","v":"M2800 金融保險"},null,{"$f":"IF($A20=\"\",\"\",VLOOKUP($A20,XX_TEJ14,2,FALSE))","v":23.39},{"$f":"IF($A20=\"\",\"\",VLOOKUP($A20,'投資組合-產品別'!$A:$G,7,FALSE))","v":-5.0000000000000711E-2},{"$f":"IF(A20=\"\",\"\",1)","v":1}]
[{"$f":"IF(OR('投資組合-產品別'!$B4=\"\",'投資組合-產品別'!$B4=0),\"\",'投資組合-產品別'!$A4)","v":"M2325 電腦及週邊設備業"},null,23.16,{"$f":"IF($A21=\"\",\"\",VLOOKUP($A21,'投資組合-產品別'!$A:$G,7,FALSE))","v":1.2100000000000009},{"$f":"IF(A21=\"\",\"\",E20+1)","v":2}]
[{"$f":"IF(OR('投資組合-產品別'!$B5=\"\",'投資組合-產品別'!$B5=0),\"\",'投資組合-產品別'!$A5)","v":"M2324 半導體業"},null,20.28,{"$f":"IF($A22=\"\",\"\",VLOOKUP($A22,'投資組合-產品別'!$A:$G,7,FALSE))","v":-0.32999999999999829},{"$f":"IF(A22=\"\",\"\",E21+1)","v":3}]
[{"$f":"IF(OR('投資組合-產品別'!$B6=\"\",'投資組合-產品別'!$B6=0),\"\",'投資組合-產品別'!$A6)","v":"M2327 通訊網路業"},null,8.9,{"$f":"IF($A23=\"\",\"\",VLOOKUP($A23,'投資組合-產品別'!$A:$G,7,FALSE))","v":-0.36999999999999922},{"$f":"IF(A23=\"\",\"\",E22+1)","v":4}]
[{"$f":"IF(OR('投資組合-產品別'!$B7=\"\",'投資組合-產品別'!$B7=0),\"\",'投資組合-產品別'!$A7)","v":"M2331 其他電子業"},null,4.2,{"$f":"IF($A24=\"\",\"\",VLOOKUP($A24,'投資組合-產品別'!$A:$G,7,FALSE))","v":-9.9999999999997868E-3},5]
[{"$f":"IF(OR('投資組合-產品別'!$B8=\"\",'投資組合-產品別'!$B8=0),\"\",'投資組合-產品別'!$A8)","v":"M1400 紡織纖維"},null,3.27,{"$f":"IF($A25=\"\",\"\",VLOOKUP($A25,'投資組合-產品別'!$A:$G,7,FALSE))","v":-6.999999999999984E-2},6]
[{"$f":"IF(OR('投資組合-產品別'!$B9=\"\",'投資組合-產品別'!$B9=0),\"\",'投資組合-產品別'!$A9)","v":"M2329 電子通路業"},null,3.22,{"$f":"IF($A26=\"\",\"\",VLOOKUP($A26,'投資組合-產品別'!$A:$G,7,FALSE))","v":-3.9999999999999591E-2},7]
[{"$f":"IF(OR('投資組合-產品別'!$B10=\"\",'投資組合-產品別'!$B10=0),\"\",'投資組合-產品別'!$A10)","v":"O2324 OTC 半導體業"},null,3.2,{"$f":"IF($A27=\"\",\"\",VLOOKUP($A27,'投資組合-產品別'!$A:$G,7,FALSE))","v":-7.9999999999999627E-2},8]
[{"$f":"IF(OR('投資組合-產品別'!$B11=\"\",'投資組合-產品別'!$B11=0),\"\",'投資組合-產品別'!$A11)","v":"M1200 食品工業"},null,3.05,{"$f":"IF($A28=\"\",\"\",VLOOKUP($A28,'投資組合-產品別'!$A:$G,7,FALSE))","v":-3.0000000000000249E-2},9]
[{"$f":"IF(OR('投資組合-產品別'!$B12=\"\",'投資組合-產品別'!$B12=0),\"\",'投資組合-產品別'!$A12)","v":"M1100 水泥工業"},null,2.34,{"$f":"IF($A29=\"\",\"\",VLOOKUP($A29,'投資組合-產品別'!$A:$G,7,FALSE))","v":-0.12000000000000011},10]
[{"$f":"IF(OR('投資組合-產品別'!$B13=\"\",'投資組合-產品別'!$B13=0),\"\",'投資組合-產品別'!$A13)","v":"M2100 橡膠工業"},null,2.0299999999999998,{"$f":"IF($A30=\"\",\"\",VLOOKUP($A30,'投資組合-產品別'!$A:$G,7,FALSE))","v":-0.14000000000000012},11]
{"$rows_left_out":44}
{"sheet":"基金屬性","index":1,"n_rows":3,"n_cols":21,"rows_kept":3,"cut":false,"hidden":false,"merged":[]}
["00878 國泰永續高股息"]
["基金統編","基金全稱","基金英文全稱","現任經理人Ａ","現任經理人Ｂ","公會分類","傘狀基金","傘狀基金成員1","傘狀基金成員2","成立資產","成立日","型態","投資標的","經理費上限%","經理費下限%","保管費上限%","保管費下限%","銷售費上限%","銷售費下限%","贖回費(元)","受益人大會費用(萬元)"]
["88090913","國泰台灣高股息傘型證券投資信託基金之台灣ESG永續高股息ETF證券投資信託基金","Cathay MSCI Taiwan ESG Sustainability High Dividend Yield ETF","游日傑(2021/03/01到任)",null,"國內指數-一般ETF","Y","T3786A 國泰台灣高股息傘型證券投資信託基金之台灣高股息證券投資信託基金 A類型新臺幣",null,6769050,"2020-07-10","國內募集,投資國內","ETF",0.3,0.25,0.03,null,2,0,0,100]

{"sheet":"淨值及報酬","index":2,"n_rows":9,"n_cols":5,"rows_kept":9,"cut":false,"hidden":false,"merged":[]}
["00878 國泰永續高股息"]
["Data Field","2024-10-30",null,"Data Field","2024-09-30"]
["淨值(元)",22.75,null,"基金淨資產",323292924]
["淨值變動率%-日",-0.56818199999999996]
["近一個月變動率%",1.021315]
["近三個月變動率%",1.648911]
["近半年變動率%",7.4697930000000001]
["近一年變動率%",25.217426]
["近三年變動率%",53.820667]

{"sheet":"風險控管","index":3,"n_rows":11,"n_cols":3,"rows_kept":11,"cut":false,"hidden":false,"merged":[]}
["00878 國泰永續高股息"]
["Data Field","2024-10-30","2024-09-30"]
["年化標準差--12個月",13.2646,14.792899999999999]
["beta--12個月",0.75180000000000002,0.81610000000000005]
["Sharpe Index-12個月",0.50690000000000002,0.34749999999999998]
["IR--12個月（大分類）",-0.2014,-0.14180000000000001]
["年化標準差--24個月",15.904199999999999,16.186399999999999]
["beta--24個月",0.68410000000000004,0.68559999999999999]
["Sharpe Index-24個月",0.4672,0.43130000000000002]
["IR--24個月（大分類）",-0.15939999999999999,-9.6699999999999994E-2]
["淨值",22.75,22.52]

{"sheet":"基金PROFILE","index":4,"n_rows":6,"n_cols":11,"rows_kept":6,"cut":false,"hidden":false,"merged":[]}
["00878 "]
["年月日","近一個月變動率(同類型排名)","近一個月變動率(同類型檔數)","近三個月變動率(同類型排名)","近三個月變動率(同類型檔數)","近半年變動率(同類型排名)","近半年變動率(同類型檔數)","近一年變動率(同類型排名)","近一年變動率(同類型檔數)","近三年變動率(同類型排名)","近三年變動率(同類型檔數)"]
["2024-10-30",27,55,29,54,30,52,38,48,11,27]
[]
["年月日","近一個月變動率%","近三個月變動率%","近半年變動率%","近一年變動率%","近三年變動率%"]
["2024-10-30",1.021315,1.648911,7.4697930000000001,25.217426,53.820667]

{"sheet":"投資組合-個股別","index":5,"n_rows":41,"n_cols":4,"rows_kept":41,"cut":false,"hidden":false,"merged":[]}
["00878 國泰永續高股息"]
[null,"2024-09-30","2024-09-30","2024-09-30"]
["投資證券代碼","投資比率％","持股數/流通在外股數%","個股月報酬率％"]
["2454",4.7300000000000004,0.81,-5.2417999999999996]
["3034",4.72,4.84,-4.0740999999999996]
["2474",4.29,8.6199999999999992,0.21190000000000001]
["2303",3.88,1.86,-3.0634000000000001]
["2882",3.83,1.27,4.7244000000000002]
["3711",3.65,1.77,-1.6285000000000001]
["2881",3.61,0.94,3.2860999999999998]
["2377",3.45,7.59,-5.1772]
["2301",3.43,4.75,-7.0094000000000003]
["1402",3.4,5.35,5.9310999999999998]
["2324",3.4,7.49,0.30149999999999999]
["4904",3.38,3.34,0.221]
["2382",3.35,1.06,-1.4923]
["5347",3.34,6.37,-15.8537]
["3045",3.27,2.4700000000000002,2.6783999999999999]
["2379",3.21,4.3,-9.1692999999999998]
["3702",3.2,8.2200000000000006,-7.6353999999999997]
["2885",3.15,2.48,-0.627]
["3231",3.12,3.45,-0.49249999999999999]
["1216",3.07,2,5.5689000000000002]
["2890",2.89,3.04,1.0419]
["2891",2.87,1.37,5.3598999999999997]
["2886",2.75,1.53,0.89870000000000005]
["2412",2.66,0.88,1.2098]
["2376",2.58,4.82,-0.95779999999999998]
["1101",2.5299999999999998,3.2,2.5796999999999999]
["2356",2.5,5.23,-5.4824000000000002]
{"$rows_left_out":12}
{"sheet":"投資組合-產品別","index":6,"n_rows":84,"n_cols":7,"rows_kept":84,"cut":false,"hidden":false,"merged":[]}
["00878 國泰永續高股息"]
["Data Field","2024-10-25","2024-10-18","2024-10-11","2024-10-04","2024-09-27","較上月比*"]
["M2800 金融保險",23.39,23.71,23.43,23.55,23.44,{"$f":"B3-F3","v":-5.0000000000000711E-2}]
["M2325 電腦及週邊設備業",23.16,22.71,22.48,21.92,21.95,1.2100000000000009]
["M2324 半導體業",20.28,20.21,20.53,20.5,20.61,-0.32999999999999829]
["M2327 通訊網路業",8.9,8.9600000000000009,8.98,9.15,9.27,-0.36999999999999922]
["M2331 其他電子業",4.2,4.32,4.29,4.26,4.21,-9.9999999999997868E-3]
["M1400 紡織纖維",3.27,3.2,3.21,3.33,3.34,-6.999999999999984E-2]
["M2329 電子通路業",3.22,3.24,3.23,3.2,3.26,-3.9999999999999591E-2]
["O2324 OTC 半導體業",3.2,3.27,3.27,3.24,3.28,-7.9999999999999627E-2]
["M1200 食品工業",3.05,3.07,3.03,3.08,3.08,-3.0000000000000249E-2]
["M1100 水泥工業",2.34,2.39,2.42,2.54,2.46,-0.12000000000000011]
["M2100 橡膠工業",2.0299999999999998,2.0699999999999998,2.16,2.34,2.17,-0.14000000000000012]
["ZCC   存放金融機",1.66,1.27,1.51,1.77,1.43,0.22999999999999998]
["ZBB   附條件債券",0.44,0.44,0.45,0.45,0.45,-1.0000000000000009E-2]
["M0000 特殊",0,0,0,0,0,0]
["M1300 塑膠工業",0,0,0,0,0,0]
["M1500 電機機械",0,0,0,0,0,0]
["M1600 電器電纜",0,0,0,0,0,0]
["M1721 化學工業",0,0,0,0,0,0]
["M1722 生技醫療業",0,0,0,0,0,0]
["M1800 玻璃陶瓷",0,0,0,0,0,0]
["M1900 造紙工業",0,0,0,0,0,0]
["M2000 鋼鐵工業",0,0,0,0,0,0]
["M2200 汽車工業",0,0,0,0,0,0]
["M2326 光電業",0,0,0,0,0,0]
["M2328 電子零組件",0,0,0,0,0,0]
["M2330 資訊服務業",0,0,0,0,0,0]
["M2500 建材營造",0,0,0,0,0,0]
["M2600 航運業",0,0,0,0,0,0]
{"$rows_left_out":55}
{"sheet":"圖型","index":7,"n_rows":705,"n_cols":21,"rows_kept":705,"cut":false,"hidden":false,"merged":[[0,13,0,14],[0,16,0,17],[0,19,0,20]]}
["00878 國泰永續高股息",null,null,null,null,null,"Y9999 加權指數",null,null,null,null,null,{"$f":"MATCH($L$2,M3:M705,0)","v":250},"近一月報酬率",null,null,"近三月報酬率",null,null,"近一年報酬率"]
["年月日","淨值(元)","近一個月變動率%","近三個月變動率%","近一年變動率%",null,"年月日","淨值(元)","近一個月變動率%","近三個月變動率%","近一年變動率%",{"$f":"MIN(M3:M705)","v":"2023-10-20"},null,{"$f":"MID($A$1,FIND(\" \",$A$1)+1,12)","v":"國泰永續高股息"},"加權指數",null,{"$f":"MID($A$1,FIND(\" \",$A$1)+1,12)","v":"國泰永續高股息"},"加權指數",null,{"$f":"MID($A$1,FIND(\" \",$A$1)+1,12)","v":"國泰永續高股息"},"加權指數"]
["2024-10-30",22.75,1.021315,1.648911,25.217426,null,"2024-11-01",22780.080000000002,1.7403999999999999,0.60960000000000003,42.034599999999998,{"$f":"OFFSET(圖型!M2,圖型!$M$1,2,)","v":""},{"$f":"IF($A3=\"\",\"\",$A3)","v":"2024-10-30"},{"$f":"IF(ISERROR(VLOOKUP($M3,XX_TEJ6,3,FALSE)=TRUE),\"\",VLOOKUP($M3,XX_TEJ6,3,FALSE))","v":1.021315},{"$f":"IF(ISERROR(VLOOKUP($M3,XX_TEJ7,3,FALSE)=TRUE),\"\",VLOOKUP($M3,XX_TEJ7,3,FALSE))","v":2.6812},null,{"$f":"IF(ISERROR(VLOOKUP($M3,XX_TEJ6,4,FALSE)=TRUE),\"\",VLOOKUP($M3,XX_TEJ6,4,FALSE))","v":1.648911},{"$f":"IF(ISERROR(VLOOKUP($M3,XX_TEJ7,4,FALSE)=TRUE),\"\",VLOOKUP($M3,XX_TEJ7,4,FALSE))","v":2.6858},null,{"$f":"IF(ISERROR(VLOOKUP($M3,XX_TEJ6,5,FALSE)=TRUE),\"\",VLOOKUP($M3,XX_TEJ6,5,FALSE))","v":25.217426},{"$f":"IF(ISERROR(VLOOKUP($M3,XX_TEJ7,5,FALSE)=TRUE),\"\",VLOOKUP($M3,XX_TEJ7,5,FALSE))","v":41.307000000000002}]
["2024-10-29",22.88,0.17513200000000001,2.4979640000000001,25.869094,null,"2024-10-30",22820.43,2.6812,2.6858,41.307000000000002,"=OFFSET(圖型!P2,圖型!$P$1,2,)",{"$f":"IF($A4=\"\",\"\",$A4)","v":"2024-10-29"},0.17513200000000001,0.45469999999999999,null,2.4979640000000001,3.4384999999999999,null,25.869094,42.096899999999998]
["2024-10-28",23.05,0.91944000000000004,2.4976340000000001,26.804310000000001,null,"2024-10-29",22926.59,0.45469999999999999,3.4384999999999999,42.096899999999998,"=OFFSET(圖型!S2,圖型!$S$1,2,)","2024-10-28",0.91944000000000004,1.6442000000000001,null,2.4976340000000001,4.8776000000000002,null,26.804310000000001,43.779600000000002]
["2024-10-25",23.09,1.0503279999999999,0.70853999999999995,26.065446000000001,null,"2024-10-28",23198.07,1.6442000000000001,4.8776000000000002,43.779600000000002,null,"2024-10-25",1.0503279999999999,2.5781999999999998,null,0.70853999999999995,2.0840999999999998,null,26.065446000000001,42.727699999999999]
["2024-10-24",22.87,0.83774199999999999,-0.25100499999999998,25.05311,null,"2024-10-25",23348.45,2.5781999999999998,2.0840999999999998,42.727699999999999,null,"2024-10-24",0.83774199999999999,3.3913000000000002,null,-0.25100499999999998,1.4023000000000001,null,25.05311,42.201500000000003]
["2024-10-23",22.98,1.771479,0.228767,27.258144000000001,null,"2024-10-24",23192.52,3.3913000000000002,1.4023000000000001,42.201500000000003,null,"2024-10-23",1.771479,4.7081,null,0.228767,2.0243000000000002,null,27.258144000000001,43.587899999999998]
["2024-10-22",23.22,3.7070120000000002,3.1640290000000002,27.159185999999998,null,"2024-10-23",23334.76,4.7081,2.0243000000000002,43.587899999999998,null,"2024-10-22",3.7070120000000002,6.2096,null,3.1640290000000002,5.7443,null,27.159185999999998,43.154600000000002]
["2024-10-21",23.1,3.1710579999999999,0.49546200000000001,26.502032,null,"2024-10-22",23535.43,6.2096,5.7443,43.154600000000002,null,"2024-10-21",3.1710579999999999,6.2416999999999998,null,0.49546200000000001,2.9443000000000001,null,26.502032,43.197899999999997]
["2024-10-18",23.15,4.8460150000000004,-0.92770300000000006,25.258330000000001,null,"2024-10-21",23542.53,6.2416999999999998,2.9443000000000001,43.197899999999997,null,"2024-10-18",4.8460150000000004,8.3420000000000005,null,-0.92770300000000006,0.37980000000000003,null,25.258330000000001,42.860100000000003]
["2024-10-17",23.04,3.3647369999999999,-2.13429,23.188572000000001,null,"2024-10-18",23487.27,8.3420000000000005,0.37980000000000003,42.860100000000003,null,"2024-10-17",3.3647369999999999,5.5091999999999999,null,-2.13429,-3.0118999999999998,null,23.188572000000001,38.524799999999999]
["2024-10-16",22.84,2.467473,-3.702458,21.10455,null,"2024-10-17",23053.84,5.5091999999999999,-3.0118999999999998,38.524799999999999,null,"2024-10-16",2.467473,5.3129999999999997,null,-3.702458,-4.1097000000000001,null,21.10455,38.186700000000002]
["2024-10-15",23.01,3.3228550000000001,-3.1053310000000001,21.294536999999998,null,"2024-10-16",23010.98,5.3129999999999997,-4.1097000000000001,38.186700000000002,null,"2024-10-15",3.3228550000000001,7.0423999999999998,null,-3.1053310000000001,-2.4592999999999998,null,21.294536999999998,38.7883]
["2024-10-14",22.77,2.2451720000000002,-4.3126110000000004,20.029405000000001,null,"2024-10-15",23292.04,7.0423999999999998,-2.4592999999999998,38.7883,null,"2024-10-14",2.2451720000000002,5.5867000000000004,null,-4.3126110000000004,-3.9369999999999998,null,20.029405000000001,36.900799999999997]
["2024-10-11",22.66,3.3759109999999999,-5.5880970000000003,18.871943000000002,null,"2024-10-14",22975.29,5.5867000000000004,-3.9369999999999998,36.900799999999997,null,"2024-10-11",3.3759109999999999,8.8947000000000003,null,-5.5880970000000003,-6.1022999999999996,null,18.871943000000002,37.366799999999998]
["2024-10-09",22.53,2.0380419999999999,-5.0875899999999996,17.961811999999998,null,"2024-10-11",22901.64,8.8947000000000003,-6.1022999999999996,37.366799999999998,null,"2024-10-09",2.0380419999999999,7.1632999999999996,null,-5.0875899999999996,-5.1921999999999997,null,17.961811999999998,37.157899999999998]
["2024-10-08",22.49,0.76164699999999996,-5.2950400000000002,17.752381,null,"2024-10-09",22659.08,7.1632999999999996,-5.1921999999999997,37.157899999999998,null,"2024-10-08",0.76164699999999996,5.4871999999999996,null,-5.2950400000000002,-5.3048999999999999,null,17.752381,36.869199999999999]
["2024-10-07",22.65,1.4784930000000001,-4.2276439999999997,18.590104,null,"2024-10-08",22611.39,5.4871999999999996,-5.3048999999999999,36.869199999999999,null,"2024-10-07",1.4784930000000001,5.9126000000000003,null,-4.2276439999999997,-3.6252,null,18.590104,37.421100000000003]
["2024-10-04",22.45,2.4178820000000001,-4.916347,19.386761,null,"2024-10-07",22702.560000000001,5.9126000000000003,-3.6252,37.421100000000003,null,"2024-10-04",2.4178820000000001,5.7363999999999997,null,-4.916347,-5.1855000000000002,null,19.386761,37.051499999999997]
["2024-10-01",22.67,-0.87450799999999995,-2.9819010000000001,20.912324000000002,null,"2024-10-04",22302.71,5.7363999999999997,-5.1855000000000002,37.051499999999997,null,"2024-10-01",-0.87450799999999995,0.54930000000000001,null,-2.9819010000000001,-2.8976000000000002,null,20.912324000000002,36.914099999999998]
["2024-09-30",22.52,-1.5303899999999999,-2.5244909999999998,20.112286000000001,null,"2024-10-01",22390.39,0.54930000000000001,-2.8976000000000002,36.914099999999998,null,"2024-09-30",-1.5303899999999999,-0.19539999999999999,null,-2.5244909999999998,-3.5066000000000002,null,20.112286000000001,35.900100000000002]
["2024-09-27",22.84,-0.13117699999999999,-0.593445,22.059069000000001,null,"2024-09-30",22224.54,-0.19539999999999999,-3.5066000000000002,35.900100000000002,null,"2024-09-27",-0.13117699999999999,2.8751000000000002,null,-0.593445,-0.36280000000000001,null,22.059069000000001,39.929499999999997]
["2024-09-26",22.93,0.218531,-0.62389700000000003,23.024864999999998,null,"2024-09-27",22822.79,2.8751000000000002,-0.36280000000000001,39.929499999999997,null,"2024-09-26",0.218531,2.7822,null,-0.62389700000000003,-0.55589999999999995,null,23.024864999999998,40.445700000000002]
["2024-09-25",22.85,0.48372900000000002,-1.1378870000000001,21.573515,null,"2024-09-26",22858.81,2.7822,-0.55589999999999995,40.445700000000002,null,"2024-09-25",0.48372900000000002,2.7242000000000002,null,-1.1378870000000001,-0.49959999999999999,null,21.573515,38.350999999999999]
["2024-09-24",22.68,-0.26385199999999998,-2.2037960000000001,21.084720000000001,null,"2024-09-25",22761.599999999999,2.7242000000000002,-0.49959999999999999,38.350999999999999,null,"2024-09-24",-0.26385199999999998,1.2357,null,-2.2037960000000001,-1.6737,null,21.084720000000001,37.245100000000001]
["2024-09-23",22.58,-0.70360599999999995,-3.3670640000000001,20.550837000000001,null,"2024-09-24",22431.78,1.2357,-1.6737,37.245100000000001,null,"2024-09-23",-0.70360599999999995,0.5756,null,-3.3670640000000001,-4.1619000000000002,null,20.550837000000001,36.350299999999997]
["2024-09-20",22.39,-2.2270750000000001,-4.776821,19.301614000000001,null,"2024-09-23",22285.53,0.5756,-4.1619000000000002,36.350299999999997,null,"2024-09-20",-2.2270750000000001,-1.2020999999999999,null,-4.776821,-5.3258999999999999,null,19.301614000000001,34.018500000000003]
["2024-09-19",22.32,-2.5752950000000001,-4.5196389999999997,18.695436999999998,null,"2024-09-20",22159.42,-1.2020999999999999,-5.3258999999999999,34.018500000000003,null,"2024-09-19",-2.5752950000000001,-1.6372,null,-4.5196389999999997,-5.0270999999999999,null,18.695436999999998,32.498600000000003]
["2024-09-18",22.08,-3.2427700000000002,-4.1048799999999996,16.675619999999999,null,"2024-09-19",22042.69,-1.6372,-5.0270999999999999,32.498600000000003,null,"2024-09-18",-3.2427700000000002,-2.9998,null,-4.1048799999999996,-4.7392000000000003,null,16.675619999999999,29.828299999999999]
{"$rows_left_out":675}