{"text_format":"1","workbook":"xlsx","n_sheets":11,"sheets":["Report","Attribute","Equity","Products","Dividend","ROI(Acc)","Shareholders","Finance","Finance_yearly","YOY","Macroeconomic"],"not_rendered":{"charts":12,"images":1,"macros":1,"external_links":1,"defined_names":46,"comments":10,"pivot_tables":0},"unopened":[],"bounds":{"document_bytes":16777216,"sheet_cells":100000,"rows_first":2000,"rows_last":500,"rows_between":2000,"halvings":0,"cell_chars":16384,"cell_head_chars":4096},"cells_cut":0,"cells_raw":0,"read":"whole","date_system":"1900"}

{"sheet":"Report","index":0,"n_rows":59,"n_cols":37,"rows_kept":59,"cut":false,"hidden":false,"merged":[[13,20,14,20],[15,20,16,20],[17,20,18,20],[19,20,20,20],[21,20,22,20],[24,16,24,20],[25,16,25,17],[30,16,30,17],[3,30,3,36],[15,30,15,36],[11,16,11,20],[13,16,14,16],[15,16,16,16],[13,17,14,17],[15,17,16,17],[15,18,16,18],[13,18,14,18],[13,19,14,19],[15,19,16,19],[24,22,24,28],[26,16,26,17],[17,17,18,17],[17,18,18,18],[19,17,20,17],[0,28,2,31],[5,19,5,20],[6,19,6,20],[7,19,7,20],[8,19,8,20],[9,19,9,20],[4,19,4,20],[4,17,4,18],[5,17,5,18],[6,17,6,18],[7,17,7,18],[8,17,8,18],[3,22,3,28],[52,12,52,13],[3,16,3,20],[9,17,9,18],[27,16,27,17],[28,16,28,17],[29,16,29,17],[19,1,19,2],[20,1,20,2],[21,1,21,2],[22,1,22,2],[6,2,6,5],[7,2,7,5],[20,4,20,5],[18,4,18,5],[19,4,19,5],[11,2,12,7],[17,16,18,16],[19,16,20,16],[21,16,22,16],[9,9,9,10],[17,6,17,7],[18,6,18,7],[19,6,19,7],[18,1,18,2],[8,2,8,5],[10,2,10,7],[15,1,15,2],[16,1,16,2],[17,1,17,2],[3,9,3,14],[4,9,4,10],[5,9,5,10],[6,9,6,10],[7,9,7,10],[8,9,8,10],[33,4,33,5],[30,4,30,5],[31,4,31,5],[32,4,32,5],[27,4,27,5],[22,4,22,5],[28,4,28,5],[29,4,29,5],[26,1,26,7],[22,6,22,7],[23,6,23,7],[24,6,24,7],[23,4,23,5],[24,1,24,2],[23,1,23,2],[24,4,24,5],[19,18,20,18],[21,17,22,17],[21,18,22,18],[17,19,18,19],[19,19,20,19],[21,19,22,19],[0,1,1,1],[0,3,1,5],[5,2,5,5],[9,2,9,5],[4,2,4,5],[20,6,20,7],[21,6,21,7],[16,6,16,7],[0,11,2,14],[14,1,14,7],[11,1,12,1],[15,6,15,7],[21,4,21,5],[15,4,15,5],[11,9,11,11],[3,1,3,7],[16,4,16,5],[17,4,17,5]]}
[null,"7203",null,"請於左側方格中輸入公司代碼後，點右側更新按鈕",null,null,null,null,null,null,null,"TEJ日本個股資料表",null,null,null,null,null,null,null,null,null,null,null,null,null,null,null,null,"TEJ日本個股資料表"]
[]
[]
[null,{"$f":"Attribute!A1&\" 基本資料\"","v":"7203 Toyota 基本資料"},null,null,null,null,null,null,null,"日本總體經濟資訊概況",null,null,null,null,null,null,"日圓市場匯率",null,null,null,null,null,"損益表-累計",null,null,null,null,null,null,null,"資產負債表-累計"]
[null,"公司英文全稱",{"$f":"IF(Attribute!B3=\"\",\"\",Attribute!B3)","v":"Toyota Motor Corporation"},null,null,null,"東証市場名",{"$f":"IF(Attribute!E3=\"\",\"\",Attribute!E3)","v":"TPMJ    Tokyo Prime Market"},null,"日期",null,"出口總額(百萬美元)","進口總額(百萬美元)","CPI消費者物價指數","CPI年增率",null,"日期","兌美元",null,"兌台幣",null,null,"科目(十億) / 年月",{"$f":"YEAR(Finance!B2)&\"/\"&MONTH(Finance!B2)","v":"2017/3"},{"$f":"YEAR(Finance!C2)&\"/\"&MONTH(Finance!C2)","v":"2016/12"},{"$f":"YEAR(Finance_yearly!A4)&\"/\"&MONTH(Finance_yearly!A4)","v":"2016/3"},{"$f":"YEAR(Finance_yearly!A5)&\"/\"&MONTH(Finance_yearly!A5)","v":"2015/3"},{"$f":"YEAR(Finance_yearly!A6)&\"/\"&MONTH(Finance_yearly!A6)","v":"2014/3"},{"$f":"YEAR(Finance_yearly!A7)&\"/\"&MONTH(Finance_yearly!A7)","v":"2013/3"},null,"科目(十億) / 年月",{"$f":"YEAR(Finance!B2)&\"/\"&MONTH(Finance!B2)","v":"2017/3"},{"$f":"YEAR(Finance!C2)&\"/\"&MONTH(Finance!C2)","v":"2016/12"},{"$f":"YEAR(Finance_yearly!A4)&\"/\"&MONTH(Finance_yearly!A4)","v":"2016/3"},{"$f":"YEAR(Finance_yearly!A5)&\"/\"&MONTH(Finance_yearly!A5)","v":"2015/3"},{"$f":"YEAR(Finance_yearly!A6)&\"/\"&MONTH(Finance_yearly!A6)","v":"2014/3"},{"$f":"YEAR(Finance_yearly!A7)&\"/\"&MONTH(Finance_yearly!A7)","v":"2013/3"}]
[null,"國際證券辨識碼",{"$f":"IF(Attribute!D3=\"\",\"\",Attribute!D3)","v":"JP3633400001"},null,null,null,"上市日(東証)",{"$f":"IF(Attribute!F3=\"\",\"\",Attribute!F3)","v":"1949-05-16"},null,{"$f":"Macroeconomic!I15","v":"2017-05-31"},null,{"$f":"Macroeconomic!J15","v":52131},{"$f":"Macroeconomic!K15","v":53943},{"$f":"Macroeconomic!L15","v":0},{"$f":"Macroeconomic!M15","v":0},null,{"$f":"Macroeconomic!F5","v":"2023-07-21"},{"$f":"Macroeconomic!G5","v":7.0516900000000002E-3},null,{"$f":"Macroeconomic!H5","v":0.22099993000000001},null,null,{"$f":"Finance_yearly!B2","v":"銷貨收入及營業收入"},{"$f":"IF(Finance!B3=\"\",\"\",Finance!B3)","v":""},{"$f":"IF(Finance!C3=\"\",\"\",Finance!C3)","v":""},{"$f":"IF(Finance_yearly!B4=\"\",\"\",Finance_yearly!B4)","v":""},{"$f":"IF(Finance_yearly!B5=\"\",\"\",Finance_yearly!B5)","v":""},{"$f":"IF(Finance_yearly!B6=\"\",\"\",Finance_yearly!B6)","v":""},{"$f":"IF(Finance_yearly!B7=\"\",\"\",Finance_yearly!B7)","v":""},null,{"$f":"Finance_yearly!AS2","v":"流動資產"},{"$f":"Finance!B46","v":0},{"$f":"Finance!C46","v":0},{"$f":"Finance_yearly!AS4","v":0},{"$f":"Finance_yearly!AS5","v":0},{"$f":"Finance_yearly!AS6","v":0},{"$f":"Finance_yearly!AS7","v":0}]
[null,"會計月制",{"$f":"IF(Attribute!Y3=\"\",\"\",Attribute!Y3)","v":"0331"},null,null,null,"下市日(東証)",{"$f":"IF(Attribute!G3=\"\",\"\",Attribute!G3)","v":""},null,{"$f":"Macroeconomic!I16","v":"2017-04-28"},null,{"$f":"Macroeconomic!J16","v":57508},{"$f":"Macroeconomic!K16","v":53137},{"$f":"Macroeconomic!L16","v":100.3},{"$f":"Macroeconomic!M16","v":0.4},null,{"$f":"Macroeconomic!F6","v":"2023-07-20"},{"$f":"Macroeconomic!G6","v":7.1392900000000004E-3},null,{"$f":"Macroeconomic!H6","v":0.22210323000000001},null,null,{"$f":"Finance_yearly!C2","v":"營業成本及費用"},{"$f":"IF(Finance!B4=\"\",\"\",Finance!B4)","v":""},{"$f":"IF(Finance!C4=\"\",\"\",Finance!C4)","v":""},{"$f":"IF(Finance_yearly!C4=\"\",\"\",Finance_yearly!C4)","v":""},{"$f":"IF(Finance_yearly!C5=\"\",\"\",Finance_yearly!C5)","v":""},{"$f":"IF(Finance_yearly!C6=\"\",\"\",Finance_yearly!C6)","v":""},{"$f":"IF(Finance_yearly!C7=\"\",\"\",Finance_yearly!C7)","v":""},null,{"$f":"Finance_yearly!AT2","v":"非流動資產"},{"$f":"Finance!B47","v":0},{"$f":"Finance!C47","v":0},{"$f":"Finance_yearly!AT4","v":0},{"$f":"Finance_yearly!AT5","v":0},{"$f":"Finance_yearly!AT6","v":0},{"$f":"Finance_yearly!AT7","v":0}]
[null,"設立日期",{"$f":"IF(Attribute!AC3=\"\",\"\",Attribute!AC3)","v":"1937-08-28"},null,null,null,"大証市場名",{"$f":"IF(Attribute!I3=\"\",\"\",Attribute!I3)","v":"OS1J    Osaka First Section"},null,{"$f":"Macroeconomic!I17","v":"2017-03-31"},null,{"$f":"Macroeconomic!J17","v":63971},{"$f":"Macroeconomic!K17","v":58570},{"$f":"Macroeconomic!L17","v":99.9},{"$f":"Macroeconomic!M17","v":0.2},null,{"$f":"Macroeconomic!F7","v":"2023-07-19"},{"$f":"Macroeconomic!G7","v":7.16127E-3},null,{"$f":"Macroeconomic!H7","v":0.22278717000000001},null,null,{"$f":"Finance_yearly!D2","v":"營業利益"},{"$f":"IF(Finance!B5=\"\",\"\",Finance!B5)","v":""},{"$f":"IF(Finance!C5=\"\",\"\",Finance!C5)","v":""},{"$f":"IF(Finance_yearly!D4=\"\",\"\",Finance_yearly!D4)","v":""},{"$f":"IF(Finance_yearly!D5=\"\",\"\",Finance_yearly!D5)","v":""},{"$f":"IF(Finance_yearly!D6=\"\",\"\",Finance_yearly!D6)","v":""},{"$f":"IF(Finance_yearly!D7=\"\",\"\",Finance_yearly!D7)","v":""},null,{"$f":"Finance_yearly!AU2","v":"總資產"},{"$f":"Finance!B48","v":0},{"$f":"Finance!C48","v":0},{"$f":"Finance_yearly!AU4","v":0},{"$f":"Finance_yearly!AU5","v":0},{"$f":"Finance_yearly!AU6","v":0},{"$f":"Finance_yearly!AU7","v":0}]
[null,"電        話",{"$f":"IF(Attribute!AE3=\"\",\"\",Attribute!AE3)","v":"(81)-565-28-2121"},null,null,null,"上市日(大証)",{"$f":"IF(Attribute!J3=\"\",\"\",Attribute!J3)","v":"1949-05-14"},null,{"$f":"Macroeconomic!I18","v":"2017-02-24"},null,{"$f":"Macroeconomic!J18","v":56137},{"$f":"Macroeconomic!K18","v":48963},{"$f":"Macroeconomic!L18","v":99.8},{"$f":"Macroeconomic!M18","v":0.2},null,{"$f":"Macroeconomic!F8","v":"2023-07-18"},{"$f":"Macroeconomic!G8","v":7.2030499999999999E-3},null,{"$f":"Macroeconomic!H8","v":0.22336671},null,null,{"$f":"Finance_yearly!E2","v":"營業外收入"},{"$f":"IF(Finance!B6=\"\",\"\",Finance!B6)","v":""},{"$f":"IF(Finance!C6=\"\",\"\",Finance!C6)","v":""},{"$f":"IF(Finance_yearly!E4=\"\",\"\",Finance_yearly!E4)","v":""},{"$f":"IF(Finance_yearly!E5=\"\",\"\",Finance_yearly!E5)","v":""},{"$f":"IF(Finance_yearly!E6=\"\",\"\",Finance_yearly!E6)","v":""},{"$f":"IF(Finance_yearly!E7=\"\",\"\",Finance_yearly!E7)","v":""},null,{"$f":"Finance_yearly!AV2","v":"流動負債"},{"$f":"Finance!B49","v":0},{"$f":"Finance!C49","v":0},{"$f":"Finance_yearly!AV4","v":0},{"$f":"Finance_yearly!AV5","v":0},{"$f":"Finance_yearly!AV6","v":0},{"$f":"Finance_yearly!AV7","v":0}]
[null,"SICC行業別",{"$f":"IF(Attribute!AK3=\"\",\"\",Attribute!AK3)","v":"S3 製造業"},null,null,null,"下市日(大証)\n",{"$f":"IF(Attribute!K3=\"\",\"\",Attribute!K3)","v":"2013-07-16"},null,{"$f":"Macroeconomic!I19","v":"2017-01-24"},null,{"$f":"Macroeconomic!J19","v":47251},{"$f":"Macroeconomic!K19","v":56766},{"$f":"Macroeconomic!L19","v":100},{"$f":"Macroeconomic!M19","v":0.5},null,{"$f":"Macroeconomic!F9","v":"2023-07-17"},{"$f":"Macroeconomic!G9","v":7.2092900000000001E-3},null,{"$f":"Macroeconomic!H9","v":0.22370413},null,null,{"$f":"Finance_yearly!F2","v":"營業外費用合計"},{"$f":"IF(Finance!B7=\"\",\"\",Finance!B7)","v":""},{"$f":"IF(Finance!C7=\"\",\"\",Finance!C7)","v":""},{"$f":"IF(Finance_yearly!F4=\"\",\"\",Finance_yearly!F4)","v":""},{"$f":"IF(Finance_yearly!F5=\"\",\"\",Finance_yearly!F5)","v":""},{"$f":"IF(Finance_yearly!F6=\"\",\"\",Finance_yearly!F6)","v":""},{"$f":"IF(Finance_yearly!F7=\"\",\"\",Finance_yearly!F7)","v":""},null,{"$f":"Finance_yearly!AW2","v":"非流動負債"},{"$f":"Finance!B50","v":0},{"$f":"Finance!C50","v":0},{"$f":"Finance_yearly!AW4","v":0},{"$f":"Finance_yearly!AW5","v":0},{"$f":"Finance_yearly!AW6","v":0},{"$f":"Finance_yearly!AW7","v":0}]
[null,"網        址",{"$f":"IF(Attribute!AG3=\"\",\"\",Attribute!AG3)","v":"http://www.toyota.co.jp/"},null,null,null,null,null,null,null,null,null,null,null,null,null,null,null,null,null,null,null,{"$f":"Finance_yearly!G2","v":"經常收入"},{"$f":"IF(Finance!B8=\"\",\"\",Finance!B8)","v":""},{"$f":"IF(Finance!C8=\"\",\"\",Finance!C8)","v":""},{"$f":"IF(Finance_yearly!G4=\"\",\"\",Finance_yearly!G4)","v":""},{"$f":"IF(Finance_yearly!G5=\"\",\"\",Finance_yearly!G5)","v":""},{"$f":"IF(Finance_yearly!G6=\"\",\"\",Finance_yearly!G6)","v":""},{"$f":"IF(Finance_yearly!G7=\"\",\"\",Finance_yearly!G7)","v":""},null,{"$f":"Finance_yearly!AX2","v":"總負債"},{"$f":"Finance!B51","v":0},{"$f":"Finance!C51","v":0},{"$f":"Finance_yearly!AX4","v":0},{"$f":"Finance_yearly!AX5","v":0},{"$f":"Finance_yearly!AX6","v":0},{"$f":"Finance_yearly!AX7","v":0}]
[null,"地　　址",{"$f":"IF(Attribute!AS3=\"\",\"\",Attribute!AS3)","v":"1-4-18, Koraku, Bunkyo-ku, Tokyo Metro."},null,null,null,null,null,null,"股價及報酬率",null,null,null,null,null,null,"產銷組合-產品別",null,null,null,null,null,{"$f":"Finance_yearly!H2","v":"經常費用"},{"$f":"IF(Finance!B9=\"\",\"\",Finance!B9)","v":""},{"$f":"IF(Finance!C9=\"\",\"\",Finance!C9)","v":""},{"$f":"IF(Finance_yearly!H4=\"\",\"\",Finance_yearly!H4)","v":""},{"$f":"IF(Finance_yearly!H5=\"\",\"\",Finance_yearly!H5)","v":""},{"$f":"IF(Finance_yearly!H6=\"\",\"\",Finance_yearly!H6)","v":""},{"$f":"IF(Finance_yearly!H7=\"\",\"\",Finance_yearly!H7)","v":""},null,{"$f":"Finance_yearly!AY2","v":"股東資本金"},{"$f":"Finance!B52","v":0},{"$f":"Finance!C52","v":0},{"$f":"Finance_yearly!AY4","v":0},{"$f":"Finance_yearly!AY5","v":0},{"$f":"Finance_yearly!AY6","v":0},{"$f":"Finance_yearly!AY7","v":0}]
[null,null,null,null,null,null,null,null,null,{"$f":"Equity!Q2","v":"2023-07-21"},"個股","主要指數",null,null,null,null,"產品別","營收毛利構成%","收入比率%","收入(十億)","佔比變動",null,{"$f":"Finance_yearly!I2","v":"經常利益"},{"$f":"IF(Finance!B10=\"\",\"\",Finance!B10)","v":""},{"$f":"IF(Finance!C10=\"\",\"\",Finance!C10)","v":""},{"$f":"IF(Finance_yearly!I4=\"\",\"\",Finance_yearly!I4)","v":""},{"$f":"IF(Finance_yearly!I5=\"\",\"\",Finance_yearly!I5)","v":""},{"$f":"IF(Finance_yearly!I6=\"\",\"\",Finance_yearly!I6)","v":""},{"$f":"IF(Finance_yearly!I7=\"\",\"\",Finance_yearly!I7)","v":""},null,{"$f":"Finance_yearly!AZ2","v":"少數股權"},{"$f":"Finance!B53","v":0},{"$f":"Finance!C53","v":0},{"$f":"Finance_yearly!AZ4","v":0},{"$f":"Finance_yearly!AZ5","v":0},{"$f":"Finance_yearly!AZ6","v":0},{"$f":"Finance_yearly!AZ7","v":0}]
[null,null,null,null,null,null,null,null,null,"收盤價",{"$f":"Equity!Q3","v":2287.5},{"$f":"Equity!Q12","v":32304.25},null,null,null,null,{"$f":"IF(Products!A4=\"\",\"\",(Products!A4))","v":"M3260008  Automobile Machine Department"},{"$f":"IF(Products!B4=\"\",\"-\",(Products!B4))","v":"-"},{"$f":"IF(Products!C4=\"\",\"-\",(Products!C4))","v":"-"},{"$f":"IF(Products!D4=\"\",\"-\",(Products!D4))","v":"-"},{"$f":"IF(Products!H4=\"\",\"\",IF(Products!H4=0,\"-\",IF(Products!H4>0,\"↑ \"&Products!H4,\"↓ \"&Products!H4)))","v":"-"},null,{"$f":"Finance_yearly!J2","v":"特別利益"},{"$f":"IF(Finance!B11=\"\",\"\",Finance!B11)","v":""},{"$f":"IF(Finance!C11=\"\",\"\",Finance!C11)","v":""},{"$f":"IF(Finance_yearly!J4=\"\",\"\",Finance_yearly!J4)","v":""},{"$f":"IF(Finance_yearly!J5=\"\",\"\",Finance_yearly!J5)","v":""},{"$f":"IF(Finance_yearly!J6=\"\",\"\",Finance_yearly!J6)","v":""},{"$f":"IF(Finance_yearly!J7=\"\",\"\",Finance_yearly!J7)","v":""},null,{"$f":"Finance_yearly!BA2","v":"股東權益"},{"$f":"Finance!B54","v":0},{"$f":"Finance!C54","v":0},{"$f":"Finance_yearly!BA4","v":0},{"$f":"Finance_yearly!BA5","v":0},{"$f":"Finance_yearly!BA6","v":0},{"$f":"Finance_yearly!BA7","v":0}]
[null,{"$f":"\"主要大股東及董監事\"&\"-\"&YEAR(Shareholders!B2)&\"/\"&MONTH(Shareholders!B2)","v":"主要大股東及董監事-2021/3"},null,null,null,null,null,null,null,"日報酬率%",{"$f":"Equity!Q4","v":2.1899999999999999E-2},{"$f":"Equity!Q13","v":-0.57330000000000003},null,null,null,null,null,null,null,null,null,null,{"$f":"Finance_yearly!K2","v":"特別損失"},{"$f":"IF(Finance!B12=\"\",\"\",Finance!B12)","v":""},{"$f":"IF(Finance!C12=\"\",\"\",Finance!C12)","v":""},{"$f":"IF(Finance_yearly!K43=\"\",\"\",Finance_yearly!K4)","v":""},{"$f":"IF(Finance_yearly!K5=\"\",\"\",Finance_yearly!K5)","v":""},{"$f":"IF(Finance_yearly!K6=\"\",\"\",Finance_yearly!K6)","v":""},{"$f":"IF(Finance_yearly!K7=\"\",\"\",Finance_yearly!K7)","v":""},null,{"$f":"Finance_yearly!BB2","v":"負債及股東權益"},{"$f":"Finance!B55","v":0},{"$f":"Finance!C55","v":0},{"$f":"Finance_yearly!BB4","v":0},{"$f":"Finance_yearly!BB5","v":0},{"$f":"Finance_yearly!BB6","v":0},{"$f":"Finance_yearly!BB7","v":0}]
[null,"名稱",null,"持股數(股)","持股率",null,"職稱",null,null,"週報酬率%",{"$f":"Equity!Q5","v":3.1335000000000002},{"$f":"Equity!Q14","v":-0.26860000000000001},null,null,null,null,{"$f":"IF(Products!A5=\"\",\"\",(Products!A5))","v":"M65M0002  Finance B."},{"$f":"IF(Products!B5=\"\",\"-\",(Products!B5))","v":"-"},{"$f":"IF(Products!C5=\"\",\"-\",(Products!C5))","v":"-"},{"$f":"IF(Products!D5=\"\",\"-\",(Products!D5))","v":"-"},{"$f":"IF(Products!H5=\"\",\"\",IF(Products!H5=0,\"-\",IF(Products!H5>0,\"↑ \"&Products!H5,\"↓ \"&Products!H5)))","v":"-"},null,{"$f":"Finance_yearly!L2","v":"稅前淨利"},{"$f":"IF(Finance!B13=\"\",\"\",Finance!B13)","v":""},{"$f":"IF(Finance!C13=\"\",\"\",Finance!C13)","v":""},{"$f":"IF(Finance_yearly!L4=\"\",\"\",Finance_yearly!L4)","v":""},{"$f":"IF(Finance_yearly!L5=\"\",\"\",Finance_yearly!L5)","v":""},{"$f":"IF(Finance_yearly!L6=\"\",\"\",Finance_yearly!L6)","v":""},{"$f":"IF(Finance_yearly!L7=\"\",\"\",Finance_yearly!L7)","v":""},null,"現金流量表-累計",{"$f":"Finance_yearly!B13","v":0},{"$f":"Finance_yearly!#REF!","v":{"$error":"#REF!"}},{"$f":"Finance_yearly!D13","v":0},{"$f":"Finance_yearly!E13","v":0},{"$f":"Finance_yearly!F13","v":0},{"$f":"Finance_yearly!G13","v":0}]
[null,{"$f":"IF(Shareholders!A4=\"\",\"\",Shareholders!A4)","v":"Akio Toyota"},null,{"$f":"IF(Shareholders!B4=\"\",\"\",Shareholders!B4)","v":4792000},{"$f":"IF(Shareholders!C4=\"\",\"\",Shareholders!C4)","v":0.15},null,{"$f":"IF(Shareholders!D4=\"\",\"\",Shareholders!D4)","v":"President"},null,null,"月報酬率%",{"$f":"Equity!Q6","v":3.1103000000000001},{"$f":"Equity!Q15","v":-3.7854000000000001},null,null,null,null,null,null,null,null,null,null,{"$f":"Finance_yearly!M2","v":"合併淨利"},{"$f":"IF(Finance!B14=\"\",\"\",Finance!B14)","v":""},{"$f":"IF(Finance!C14=\"\",\"\",Finance!C14)","v":""},{"$f":"IF(Finance_yearly!M4=\"\",\"\",Finance_yearly!M4)","v":""},{"$f":"IF(Finance_yearly!M5=\"\",\"\",Finance_yearly!M5)","v":""},{"$f":"IF(Finance_yearly!M6=\"\",\"\",Finance_yearly!M6)","v":""},{"$f":"IF(Finance_yearly!M7=\"\",\"\",Finance_yearly!M7)","v":""},null,"科目(十億) / 年月",{"$f":"YEAR(Finance!B2)&\"/\"&MONTH(Finance!B2)","v":"2017/3"},{"$f":"YEAR(Finance!C2)&\"/\"&MONTH(Finance!C2)","v":"2016/12"},{"$f":"YEAR(Finance_yearly!A4)&\"/\"&MONTH(Finance_yearly!A4)","v":"2016/3"},{"$f":"YEAR(Finance_yearly!A5)&\"/\"&MONTH(Finance_yearly!A5)","v":"2015/3"},{"$f":"YEAR(Finance_yearly!A6)&\"/\"&MONTH(Finance_yearly!A6)","v":"2014/3"},{"$f":"YEAR(Finance_yearly!A7)&\"/\"&MONTH(Finance_yearly!A7)","v":"2013/3"}]
[null,{"$f":"IF(Shareholders!A5=\"\",\"\",Shareholders!A5)","v":"Takeshi Uchiyamada"},null,{"$f":"IF(Shareholders!B5=\"\",\"\",Shareholders!B5)","v":85000},{"$f":"IF(Shareholders!C5=\"\",\"\",Shareholders!C5)","v":0},null,{"$f":"IF(Shareholders!D5=\"\",\"\",Shareholders!D5)","v":"Chairman"},null,null,"年報酬率%",{"$f":"Equity!Q7","v":7.6234999999999999},{"$f":"Equity!Q16","v":16.1905},null,null,null,null,{"$f":"IF(Products!A6=\"\",\"\",(Products!A6))","v":"M7620033  Others"},{"$f":"IF(Products!B6=\"\",\"-\",(Products!B6))","v":"-"},{"$f":"IF(Products!C6=\"\",\"-\",(Products!C6))","v":"-"},{"$f":"IF(Products!D6=\"\",\"-\",(Products!D6))","v":"-"},{"$f":"IF(Products!H6=\"\",\"\",IF(Products!H6=0,\"-\",IF(Products!H6>0,\"↑ \"&Products!H6,\"↓ \"&Products!H6)))","v":"-"},null,{"$f":"Finance_yearly!N2","v":"特別股息"},{"$f":"IF(Finance!B15=\"\",\"\",Finance!B15)","v":""},{"$f":"IF(Finance!C15=\"\",\"\",Finance!C15)","v":""},{"$f":"IF(Finance_yearly!N4=\"\",\"\",Finance_yearly!N4)","v":""},{"$f":"IF(Finance_yearly!N5=\"\",\"\",Finance_yearly!N5)","v":""},{"$f":"IF(Finance_yearly!N6=\"\",\"\",Finance_yearly!N6)","v":""},{"$f":"IF(Finance_yearly!N7=\"\",\"\",Finance_yearly!N7)","v":""},null,{"$f":"Finance_yearly!AM2","v":"營運產生現金流量淨額"},{"$f":"Finance!B40","v":0},{"$f":"Finance!C40","v":0},{"$f":"Finance_yearly!AM4","v":0},{"$f":"Finance_yearly!AM5","v":0},{"$f":"Finance_yearly!AM6","v":0},{"$f":"Finance_yearly!AM7","v":0}]
[null,{"$f":"IF(Shareholders!A6=\"\",\"\",Shareholders!A6)","v":"Sakari Sasakawa"},null,{"$f":"IF(Shareholders!B6=\"\",\"\",Shareholders!B6)","v":43000},{"$f":"IF(Shareholders!C6=\"\",\"\",Shareholders!C6)","v":0},null,{"$f":"IF(Shareholders!D6=\"\",\"\",Shareholders!D6)","v":"Vice Chairman"},null,null,null,null,null,null,null,null,null,null,null,null,null,null,null,{"$f":"Finance_yearly!O2","v":"不屬於普通股東利益"},{"$f":"IF(Finance!B16=\"\",\"\",Finance!B16)","v":""},{"$f":"IF(Finance!C16=\"\",\"\",Finance!C16)","v":""},{"$f":"IF(Finance_yearly!O4=\"\",\"\",Finance_yearly!O4)","v":""},{"$f":"IF(Finance_yearly!O5=\"\",\"\",Finance_yearly!O5)","v":""},{"$f":"IF(Finance_yearly!O6=\"\",\"\",Finance_yearly!O6)","v":""},{"$f":"IF(Finance_yearly!O7=\"\",\"\",Finance_yearly!O7)","v":""},null,{"$f":"Finance_yearly!AN2","v":"投資產生現金流量淨額"},{"$f":"Finance!B41","v":0},{"$f":"Finance!C41","v":0},{"$f":"Finance_yearly!AN4","v":0},{"$f":"Finance_yearly!AN5","v":0},{"$f":"Finance_yearly!AN6","v":0},{"$f":"Finance_yearly!AN7","v":0}]
[null,{"$f":"IF(Shareholders!A7=\"\",\"\",Shareholders!A7)","v":"Koshi Kobayashi"},null,{"$f":"IF(Shareholders!B7=\"\",\"\",Shareholders!B7)","v":34000},{"$f":"IF(Shareholders!C7=\"\",\"\",Shareholders!C7)","v":0},null,{"$f":"IF(Shareholders!D7=\"\",\"\",Shareholders!D7)","v":""},null,null,null,null,null,null,null,null,null,{"$f":"IF(Products!A7=\"\",\"\",(Products!A7))","v":""},{"$f":"IF(Products!B7=\"\",\"-\",(Products!B7))","v":"-"},{"$f":"IF(Products!B7=\"\",\"-\",(Products!B7))","v":"-"},{"$f":"IF(Products!D7=\"\",\"-\",(Products!D7))","v":"-"},{"$f":"IF(Products!H7=\"\",\"-\",IF(Products!H7=0,\"-\",IF(Products!H7>0,\"↑ \"&Products!H7,\"↓ \"&Products!H7)))","v":"-"},null,{"$f":"Finance_yearly!P2","v":"每股盈餘－加權"},{"$f":"IF(Finance!B17=\"\",\"\",Finance!B17)","v":""},{"$f":"IF(Finance!C17=\"\",\"\",Finance!C17)","v":""},{"$f":"IF(Finance_yearly!P4=\"\",\"\",Finance_yearly!P4)","v":""},{"$f":"IF(Finance_yearly!P5=\"\",\"\",Finance_yearly!P5)","v":""},{"$f":"IF(Finance_yearly!P6=\"\",\"\",Finance_yearly!P6)","v":""},{"$f":"IF(Finance_yearly!P7=\"\",\"\",Finance_yearly!P7)","v":""},null,{"$f":"Finance_yearly!AO2","v":"理財產生現金流量淨額"},{"$f":"Finance!B42","v":0},{"$f":"Finance!C42","v":0},{"$f":"Finance_yearly!AO4","v":0},{"$f":"Finance_yearly!AO5","v":0},{"$f":"Finance_yearly!AO6","v":0},{"$f":"Finance_yearly!AO7","v":0}]
[null,{"$f":"IF(Shareholders!A8=\"\",\"\",Shareholders!A8)","v":"Masashu Yasuda"},null,{"$f":"IF(Shareholders!B8=\"\",\"\",Shareholders!B8)","v":11000},{"$f":"IF(Shareholders!C8=\"\",\"\",Shareholders!C8)","v":0},null,{"$f":"IF(Shareholders!D8=\"\",\"\",Shareholders!D8)","v":""},null,null,null,null,null,null,null,null,null,null,null,null,null,null,null,{"$f":"Finance_yearly!Q2","v":"加權平均普通股數-千"},{"$f":"IF(Finance!B18=\"\",\"\",Finance!B18)","v":""},{"$f":"IF(Finance!C18=\"\",\"\",Finance!C18)","v":""},{"$f":"IF(Finance_yearly!Q4=\"\",\"\",Finance_yearly!Q4)","v":""},{"$f":"IF(Finance_yearly!Q5=\"\",\"\",Finance_yearly!Q5)","v":""},{"$f":"IF(Finance_yearly!Q6=\"\",\"\",Finance_yearly!Q6)","v":""},{"$f":"IF(Finance_yearly!Q7=\"\",\"\",Finance_yearly!Q7)","v":""},null,{"$f":"Finance_yearly!AP2","v":"現金及等價物淨增減額"},{"$f":"Finance!B43","v":0},{"$f":"Finance!C43","v":0},{"$f":"Finance_yearly!AP4","v":0},{"$f":"Finance_yearly!AP5","v":0},{"$f":"Finance_yearly!AP6","v":0},{"$f":"Finance_yearly!AP7","v":0}]
[null,{"$f":"IF(Shareholders!A9=\"\",\"\",Shareholders!A9)","v":"Katsuyuki Ogura"},null,{"$f":"IF(Shareholders!B9=\"\",\"\",Shareholders!B9)","v":5000},{"$f":"IF(Shareholders!C9=\"\",\"\",Shareholders!C9)","v":0},null,{"$f":"IF(Shareholders!D9=\"\",\"\",Shareholders!D9)","v":""},null,null,null,null,null,null,null,null,null,{"$f":"IF(Products!A8=\"\",\"\",(Products!A8))","v":""},{"$f":"IF(Products!B8=\"\",\"-\",(Products!B8))","v":"-"},{"$f":"IF(Products!B8=\"\",\"-\",(Products!B8))","v":"-"},{"$f":"IF(Products!D8=\"\",\"-\",(Products!D8))","v":"-"},{"$f":"IF(Products!H9=\"\",\"-\",IF(Products!H9=0,\"-\",IF(Products!H9>0,\"↑ \"&Products!H9,\"↓ \"&Products!H9)))","v":"-"},null,{"$f":"Finance_yearly!R2","v":"員工人數及臨時員工數"},{"$f":"IF(Finance!B19=\"\",\"\",Finance!B19)","v":""},{"$f":"IF(Finance!C19=\"\",\"\",Finance!C19)","v":""},{"$f":"IF(Finance_yearly!R4=\"\",\"\",Finance_yearly!R4)","v":""},{"$f":"IF(Finance_yearly!R5=\"\",\"\",Finance_yearly!R5)","v":""},{"$f":"IF(Finance_yearly!R6=\"\",\"\",Finance_yearly!R6)","v":""},{"$f":"IF(Finance_yearly!R7=\"\",\"\",Finance_yearly!R7)","v":""},null,{"$f":"Finance_yearly!AQ2","v":"現金及等價物期初金額"},{"$f":"Finance!B44","v":0},{"$f":"Finance!C44","v":0},{"$f":"Finance_yearly!AQ4","v":0},{"$f":"Finance_yearly!AQ5","v":0},{"$f":"Finance_yearly!AQ6","v":0},{"$f":"Finance_yearly!AQ7","v":0}]
[null,{"$f":"IF(Shareholders!A10=\"\",\"\",Shareholders!A10)","v":"Kenta Kon"},null,{"$f":"IF(Shareholders!B10=\"\",\"\",Shareholders!B10)","v":5000},{"$f":"IF(Shareholders!C10=\"\",\"\",Shareholders!C10)","v":0},null,{"$f":"IF(Shareholders!D10=\"\",\"\",Shareholders!D10)","v":""},null,null,null,null,null,null,null,null,null,null,null,null,null,null,null,{"$f":"Finance_yearly!S2","v":"員工人數"},{"$f":"IF(Finance!B20=\"\",\"\",Finance!B20)","v":""},{"$f":"IF(Finance!C20=\"\",\"\",Finance!C20)","v":""},{"$f":"IF(Finance_yearly!S4=\"\",\"\",Finance_yearly!S4)","v":""},{"$f":"IF(Finance_yearly!S5=\"\",\"\",Finance_yearly!S5)","v":""},{"$f":"IF(Finance_yearly!S6=\"\",\"\",Finance_yearly!S6)","v":""},{"$f":"IF(Finance_yearly!S7=\"\",\"\",Finance_yearly!S7)","v":""},null,{"$f":"Finance_yearly!AR2","v":"現金及等價物期末金額"},{"$f":"Finance!B45","v":0},{"$f":"Finance!C45","v":0},{"$f":"Finance_yearly!AR4","v":0},{"$f":"Finance_yearly!AR5","v":0},{"$f":"Finance_yearly!AR6","v":0},{"$f":"Finance_yearly!AR7","v":0}]
[null,{"$f":"IF(Shareholders!A11=\"\",\"\",Shareholders!A11)","v":"Jihiko Kato"},null,{"$f":"IF(Shareholders!B11=\"\",\"\",Shareholders!B11)","v":1000},{"$f":"IF(Shareholders!C11=\"\",\"\",Shareholders!C11)","v":0},null,{"$f":"IF(Shareholders!D11=\"\",\"\",Shareholders!D11)","v":""},null,null,null,null,null,null,null,null,null,null,null,null,null,null,null,{"$f":"Finance_yearly!T2","v":"當期平均臨時員工人數"},{"$f":"IF(Finance!B21=\"\",\"\",Finance!B21)","v":""},{"$f":"IF(Finance!C21=\"\",\"\",Finance!C21)","v":""},{"$f":"IF(Finance_yearly!T4=\"\",\"\",Finance_yearly!T4)","v":""},{"$f":"IF(Finance_yearly!T5=\"\",\"\",Finance_yearly!T5)","v":""},{"$f":"IF(Finance_yearly!T6=\"\",\"\",Finance_yearly!T6)","v":""},{"$f":"IF(Finance_yearly!T7=\"\",\"\",Finance_yearly!T7)","v":""}]
[null,{"$f":"IF(Shareholders!A12=\"\",\"\",Shareholders!A12)","v":"Nobuyuki Hirano"},null,{"$f":"IF(Shareholders!B12=\"\",\"\",Shareholders!B12)","v":1000},{"$f":"IF(Shareholders!C12=\"\",\"\",Shareholders!C12)","v":0},null,{"$f":"IF(Shareholders!D12=\"\",\"\",Shareholders!D12)","v":""},null,null,null,null,null,null,null,null,null,"產銷組合-地區別",null,null,null,null,null,"財務比率(%)"]
[null,null,null,null,null,null,null,null,null,null,null,null,null,null,null,null,"銷貨地區",null,"幣別","營業收入","營業收入構成％",null,"科目(十億) / 年月",{"$f":"YEAR(Finance!B2)&\"/\"&MONTH(Finance!B22)","v":"2017/1"},{"$f":"YEAR(Finance!C2)&\"/\"&MONTH(Finance!C2)","v":"2016/12"},{"$f":"YEAR(Finance_yearly!A4)&\"/\"&MONTH(Finance_yearly!A4)","v":"2016/3"},{"$f":"YEAR(Finance_yearly!A5)&\"/\"&MONTH(Finance_yearly!A5)","v":"2015/3"},{"$f":"YEAR(Finance_yearly!A6)&\"/\"&MONTH(Finance_yearly!A6)","v":"2014/3"},{"$f":"YEAR(Finance_yearly!A7)&\"/\"&MONTH(Finance_yearly!A7)","v":"2013/3"}]
[null,"現金股息 ",null,null,null,null,null,null,null,null,null,null,null,null,null,null,{"$f":"IF(Products!A22=\"\",\"\",(Products!A22))","v":"S0030001  Americas"},null,{"$f":"IF(Products!B22=\"\",\"\",(Products!B22))","v":"JPY"},{"$f":"IF(Products!C22=\"\",\"\",(Products!C22))","v":10054.431},{"$f":"IF(Products!D22=\"\",\"\",(Products!D22))","v":36.43},null,{"$f":"Finance_yearly!U2","v":"營業利益率"},{"$f":"Finance!B22","v":0},{"$f":"Finance!C22","v":0},{"$f":"IF(Finance_yearly!U4=\"\",\"\",Finance_yearly!U4)","v":""},{"$f":"IF(Finance_yearly!U5=\"\",\"\",Finance_yearly!U5)","v":""},{"$f":"IF(Finance_yearly!U6=\"\",\"\",Finance_yearly!U6)","v":""},{"$f":"IF(Finance_yearly!U7=\"\",\"\",Finance_yearly!U7)","v":""}]
[null,"除息日","股息總額(百萬)","發放日","發放年度",null,"幣別單位","期末總發行股數",null,null,null,null,null,null,null,null,{"$f":"IF(Products!A23=\"\",\"\",(Products!A23))","v":"S0050001  Asia"},null,{"$f":"IF(Products!B23=\"\",\"\",(Products!B23))","v":"JPY"},{"$f":"IF(Products!C23=\"\",\"\",(Products!C23))","v":4414.2359999999999},{"$f":"IF(Products!D23=\"\",\"\",(Products!D23))","v":16},null,{"$f":"Finance_yearly!V2","v":"稅前淨利率"},{"$f":"Finance!B23","v":0},{"$f":"Finance!C23","v":0},{"$f":"IF(Finance_yearly!V4=\"\",\"\",Finance_yearly!V4)","v":""},{"$f":"IF(Finance_yearly!V5=\"\",\"\",Finance_yearly!V5)","v":""},{"$f":"IF(Finance_yearly!V6=\"\",\"\",Finance_yearly!V6)","v":""},{"$f":"IF(Finance_yearly!V7=\"\",\"\",Finance_yearly!V7)","v":""}]
[null,{"$f":"IF(Dividend!A3=\"\",\"\",Dividend!A3)","v":"2017-03-29"},{"$f":"IF(Dividend!B3=\"\",\"\",Dividend!B3)","v":""},{"$f":"IF(Dividend!C3=\"\",\"\",Dividend!C3)","v":""},{"$f":"IF(Dividend!D3=\"\",\"\",Dividend!D3)","v":""},null,{"$f":"IF(Dividend!E3=\"\",\"\",Dividend!E3)","v":""},{"$f":"IF(Dividend!F3=\"\",\"\",Dividend!F3)","v":""},null,null,null,null,null,null,null,null,{"$f":"IF(Products!A24=\"\",\"\",(Products!A24))","v":"S0060001  Europe"},null,{"$f":"IF(Products!B24=\"\",\"\",(Products!B24))","v":"JPY"},{"$f":"IF(Products!C24=\"\",\"\",(Products!C24))","v":2341.364},{"$f":"IF(Products!D24=\"\",\"\",(Products!D24))","v":8.48},null,{"$f":"Finance_yearly!W2","v":"稅後淨利率"},{"$f":"Finance!B24","v":0},{"$f":"Finance!C24","v":0},{"$f":"IF(Finance_yearly!W4=\"\",\"\",Finance_yearly!W4)","v":""},{"$f":"IF(Finance_yearly!W5=\"\",\"\",Finance_yearly!W5)","v":""},{"$f":"IF(Finance_yearly!W6=\"\",\"\",Finance_yearly!W6)","v":""},{"$f":"IF(Finance_yearly!W7=\"\",\"\",Finance_yearly!W7)","v":""}]
[null,{"$f":"IF(Dividend!A4=\"\",\"\",Dividend!A4)","v":"2016-09-28"},{"$f":"IF(Dividend!B4=\"\",\"\",Dividend!B4)","v":""},{"$f":"IF(Dividend!C4=\"\",\"\",Dividend!C4)","v":""},{"$f":"IF(Dividend!D4=\"\",\"\",Dividend!D4)","v":""},null,{"$f":"IF(Dividend!E4=\"\",\"\",Dividend!E4)","v":""},{"$f":"IF(Dividend!F4=\"\",\"\",Dividend!F4)","v":""},null,null,null,null,null,null,null,null,{"$f":"IF(Products!A25=\"\",\"\",(Products!A25))","v":"S0470001  Others Area"},null,{"$f":"IF(Products!B25=\"\",\"\",(Products!B25))","v":"JPY"},{"$f":"IF(Products!C25=\"\",\"\",(Products!C25))","v":3923.6210000000001},{"$f":"IF(Products!D25=\"\",\"\",(Products!D25))","v":14.22},null,{"$f":"Finance_yearly!X2","v":"業外收支／營收"},{"$f":"Finance!B25","v":0},{"$f":"Finance!C25","v":0},{"$f":"IF(Finance_yearly!X4=\"\",\"\",Finance_yearly!X4)","v":""},{"$f":"IF(Finance_yearly!X5=\"\",\"\",Finance_yearly!X5)","v":""},{"$f":"IF(Finance_yearly!X6=\"\",\"\",Finance_yearly!X6)","v":""},{"$f":"IF(Finance_yearly!X7=\"\",\"\",Finance_yearly!X7)","v":""}]
[null,{"$f":"IF(Dividend!A5=\"\",\"\",Dividend!A5)","v":"2016-03-29"},{"$f":"IF(Dividend!B5=\"\",\"\",Dividend!B5)","v":""},{"$f":"IF(Dividend!C5=\"\",\"\",Dividend!C5)","v":""},{"$f":"IF(Dividend!D5=\"\",\"\",Dividend!D5)","v":""},null,{"$f":"IF(Dividend!E5=\"\",\"\",Dividend!E5)","v":""},{"$f":"IF(Dividend!F5=\"\",\"\",Dividend!F5)","v":""},null,null,null,null,null,null,null,null,{"$f":"IF(Products!A26=\"\",\"\",(Products!A26))","v":""},null,{"$f":"IF(Products!B26=\"\",\"\",(Products!B26))","v":""},{"$f":"IF(Products!C26=\"\",\"\",(Products!C26))","v":""},{"$f":"IF(Products!D26=\"\",\"\",(Products!D26))","v":""},null,{"$f":"Finance_yearly!Y2","v":"收支比率"},{"$f":"Finance!B26","v":0},{"$f":"Finance!C26","v":0},{"$f":"IF(Finance_yearly!Y4=\"\",\"\",Finance_yearly!Y4)","v":""},{"$f":"IF(Finance_yearly!Y5=\"\",\"\",Finance_yearly!Y5)","v":""},{"$f":"IF(Finance_yearly!Y6=\"\",\"\",Finance_yearly!Y6)","v":""},{"$f":"IF(Finance_yearly!Y7=\"\",\"\",Finance_yearly!Y7)","v":""}]
[null,{"$f":"IF(Dividend!A6=\"\",\"\",Dividend!A6)","v":"2015-09-28"},{"$f":"IF(Dividend!B6=\"\",\"\",Dividend!B6)","v":""},{"$f":"IF(Dividend!C6=\"\",\"\",Dividend!C6)","v":""},{"$f":"IF(Dividend!D6=\"\",\"\",Dividend!D6)","v":""},null,{"$f":"IF(Dividend!E6=\"\",\"\",Dividend!E6)","v":""},{"$f":"IF(Dividend!F6=\"\",\"\",Dividend!F6)","v":""},null,null,null,null,null,null,null,null,null,null,null,null,null,null,{"$f":"Finance_yearly!Z2","v":"每股現金流量"},{"$f":"Finance!B27","v":0},{"$f":"Finance!C27","v":0},{"$f":"IF(Finance_yearly!Z4=\"\",\"\",Finance_yearly!Z4)","v":""},{"$f":"IF(Finance_yearly!Z5=\"\",\"\",Finance_yearly!Z5)","v":""},{"$f":"IF(Finance_yearly!Z6=\"\",\"\",Finance_yearly!Z6)","v":""},{"$f":"IF(Finance_yearly!Z7=\"\",\"\",Finance_yearly!Z7)","v":""}]
[null,{"$f":"IF(Dividend!A7=\"\",\"\",Dividend!A7)","v":"2015-03-27"},{"$f":"IF(Dividend!B7=\"\",\"\",Dividend!B7)","v":""},{"$f":"IF(Dividend!C7=\"\",\"\",Dividend!C7)","v":""},{"$f":"IF(Dividend!D7=\"\",\"\",Dividend!D7)","v":""},null,{"$f":"IF(Dividend!E7=\"\",\"\",Dividend!E7)","v":""},{"$f":"IF(Dividend!F7=\"\",\"\",Dividend!F7)","v":""},null,null,null,null,null,null,null,null,null,null,null,null,null,null,{"$f":"Finance_yearly!AA2","v":"每股稅前淨利"},{"$f":"Finance!B28","v":0},{"$f":"Finance!C28","v":0},{"$f":"IF(Finance_yearly!AA4=\"\",\"\",Finance_yearly!AA4)","v":""},{"$f":"IF(Finance_yearly!AA5=\"\",\"\",Finance_yearly!AA5)","v":""},{"$f":"IF(Finance_yearly!AA6=\"\",\"\",Finance_yearly!AA6)","v":""},{"$f":"IF(Finance_yearly!AA7=\"\",\"\",Finance_yearly!AA7)","v":""}]
[null,{"$f":"IF(Dividend!A8=\"\",\"\",Dividend!A8)","v":"2014-09-26"},{"$f":"IF(Dividend!B8=\"\",\"\",Dividend!B8)","v":""},{"$f":"IF(Dividend!C8=\"\",\"\",Dividend!C8)","v":""},{"$f":"IF(Dividend!D8=\"\",\"\",Dividend!D8)","v":""},null,{"$f":"IF(Dividend!E8=\"\",\"\",Dividend!E8)","v":""},{"$f":"IF(Dividend!F8=\"\",\"\",Dividend!F8)","v":""},null,null,null,null,null,null,null,null,null,null,null,null,null,null,{"$f":"Finance_yearly!AB2","v":"現金流量比率"},{"$f":"Finance!B29","v":0},{"$f":"Finance!C29","v":0},{"$f":"IF(Finance_yearly!AB4=\"\",\"\",Finance_yearly!AB4)","v":""},{"$f":"IF(Finance_yearly!AB5=\"\",\"\",Finance_yearly!AB5)","v":""},{"$f":"IF(Finance_yearly!AB6=\"\",\"\",Finance_yearly!AB6)","v":""},{"$f":"IF(Finance_yearly!AB7=\"\",\"\",Finance_yearly!AB7)","v":""}]
[null,null,null,null,null,null,null,null,null,null,null,null,null,null,null,null,null,null,null,null,null,null,{"$f":"Finance_yearly!AC2","v":"營收成長率"},{"$f":"Finance!B30","v":0},{"$f":"Finance!C30","v":0},{"$f":"IF(Finance_yearly!AC4=\"\",\"\",Finance_yearly!AC4)","v":""},{"$f":"IF(Finance_yearly!AC5=\"\",\"\",Finance_yearly!AC5)","v":""},{"$f":"IF(Finance_yearly!AC6=\"\",\"\",Finance_yearly!AC6)","v":""},{"$f":"IF(Finance_yearly!AC7=\"\",\"\",Finance_yearly!AC7)","v":""}]
[null,null,null,null,null,null,null,null,null,null,null,null,null,null,null,null,null,null,null,null,null,null,{"$f":"Finance_yearly!AD2","v":"營業利益成長率"},{"$f":"Finance!B31","v":0},{"$f":"Finance!C31","v":0},{"$f":"IF(Finance_yearly!AD4=\"\",\"\",Finance_yearly!AD4)","v":""},{"$f":"IF(Finance_yearly!AD5=\"\",\"\",Finance_yearly!AD5)","v":""},{"$f":"IF(Finance_yearly!AD6=\"\",\"\",Finance_yearly!AD6)","v":""},{"$f":"IF(Finance_yearly!AD7=\"\",\"\",Finance_yearly!AD7)","v":""}]
[null,null,null,null,null,null,null,null,null,null,null,null,null,null,null,null,null,null,null,null,null,null,{"$f":"Finance_yearly!AE2","v":"稅前淨利成長率"},{"$f":"Finance!B32","v":0},{"$f":"Finance!C32","v":0},{"$f":"IF(Finance_yearly!AE4=\"\",\"\",Finance_yearly!AE4)","v":""},{"$f":"IF(Finance_yearly!AE5=\"\",\"\",Finance_yearly!AE5)","v":""},{"$f":"IF(Finance_yearly!AE6=\"\",\"\",Finance_yearly!AE6)","v":""},{"$f":"IF(Finance_yearly!AE7=\"\",\"\",Finance_yearly!AE7)","v":""}]
[null,null,null,null,null,null,null,null,null,null,null,null,null,null,null,null,null,null,null,null,null,null,{"$f":"Finance_yearly!AF2","v":"稅後淨利成長率"},{"$f":"Finance!B33","v":0},{"$f":"Finance!C33","v":0},{"$f":"IF(Finance_yearly!AF4=\"\",\"\",Finance_yearly!AF4)","v":""},{"$f":"IF(Finance_yearly!AF5=\"\",\"\",Finance_yearly!AF5)","v":""},{"$f":"IF(Finance_yearly!AF6=\"\",\"\",Finance_yearly!AF6)","v":""},{"$f":"IF(Finance_yearly!AF7=\"\",\"\",Finance_yearly!AF7)","v":""}]
[null,null,null,null,null,null,null,null,null,null,null,null,null,null,null,null,null,null,null,null,null,null,{"$f":"Finance_yearly!AG2","v":"總資產成長率"},{"$f":"Finance!B34","v":0},{"$f":"Finance!C34","v":0},{"$f":"IF(Finance_yearly!AG4=\"\",\"\",Finance_yearly!AG4)","v":""},{"$f":"IF(Finance_yearly!AG5=\"\",\"\",Finance_yearly!AG5)","v":""},{"$f":"IF(Finance_yearly!AG6=\"\",\"\",Finance_yearly!AG6)","v":""},{"$f":"IF(Finance_yearly!AG7=\"\",\"\",Finance_yearly!AG7)","v":""}]
[null,null,null,null,null,null,null,null,null,null,null,null,null,null,null,null,null,null,null,null,null,null,{"$f":"Finance_yearly!AH2","v":"淨值成長率"},{"$f":"Finance!B35","v":0},{"$f":"Finance!C35","v":0},{"$f":"IF(Finance_yearly!AH4=\"\",\"\",Finance_yearly!AH4)","v":""},{"$f":"IF(Finance_yearly!AH5=\"\",\"\",Finance_yearly!AH5)","v":""},{"$f":"IF(Finance_yearly!AH6=\"\",\"\",Finance_yearly!AH6)","v":""},{"$f":"IF(Finance_yearly!AH7=\"\",\"\",Finance_yearly!AH7)","v":""}]
[null,null,null,null,null,null,null,null,null,null,null,null,null,null,null,null,null,null,null,null,null,null,{"$f":"Finance_yearly!AI2","v":"流動資產／流動負債"},{"$f":"Finance!B36","v":0},{"$f":"Finance!C36","v":0},{"$f":"IF(Finance_yearly!AI4=\"\",\"\",Finance_yearly!AI4)","v":""},{"$f":"IF(Finance_yearly!AI5=\"\",\"\",Finance_yearly!AI5)","v":""},{"$f":"IF(Finance_yearly!AI6=\"\",\"\",Finance_yearly!AI6)","v":""},{"$f":"IF(Finance_yearly!AI7=\"\",\"\",Finance_yearly!AI7)","v":""}]
[null,null,null,null,null,null,null,null,null,null,null,null,null,null,null,null,null,null,null,null,null,null,{"$f":"Finance_yearly!AJ2","v":"總負債／總淨值"},{"$f":"Finance!B37","v":0},{"$f":"Finance!C37","v":0},{"$f":"IF(Finance_yearly!AJ4=\"\",\"\",Finance_yearly!AJ4)","v":""},{"$f":"IF(Finance_yearly!AJ5=\"\",\"\",Finance_yearly!AJ5)","v":""},{"$f":"IF(Finance_yearly!AJ6=\"\",\"\",Finance_yearly!AJ6)","v":""},{"$f":"IF(Finance_yearly!AJ7=\"\",\"\",Finance_yearly!AJ7)","v":""}]
[null,null,null,null,null,null,null,null,null,null,null,null,null,null,null,null,null,null,null,null,null,null,{"$f":"Finance_yearly!AK2","v":"負債比率"},{"$f":"Finance!B38","v":0},{"$f":"Finance!C38","v":0},{"$f":"IF(Finance_yearly!AK4=\"\",\"\",Finance_yearly!AK4)","v":""},{"$f":"IF(Finance_yearly!AK5=\"\",\"\",Finance_yearly!AK5)","v":""},{"$f":"IF(Finance_yearly!AK6=\"\",\"\",Finance_yearly!AK6)","v":""},{"$f":"IF(Finance_yearly!AK7=\"\",\"\",Finance_yearly!AK7)","v":""}]
[null,null,null,null,null,null,null,null,null,null,null,null,null,null,null,null,null,null,null,null,null,null,{"$f":"Finance_yearly!AL2","v":"淨值／資產"},{"$f":"Finance!B39","v":0},{"$f":"Finance!C39","v":0},{"$f":"IF(Finance_yearly!AL4=\"\",\"\",Finance_yearly!AL4)","v":""},{"$f":"IF(Finance_yearly!AL5=\"\",\"\",Finance_yearly!AL5)","v":""},{"$f":"IF(Finance_yearly!AL6=\"\",\"\",Finance_yearly!AL6)","v":""},{"$f":"IF(Finance_yearly!AL7=\"\",\"\",Finance_yearly!AL7)","v":""}]
[null,null,null,null,null,null,null,null,null,null,null,null,null,null,null,null,null,null,null,null,null,null,null,{"$f":"IF(Finance_yearly!B147=\"\",\"\",Finance_yearly!B147)","v":""},{"$f":"IF(Finance_yearly!C147=\"\",\"\",Finance_yearly!C147)","v":""},{"$f":"IF(Finance_yearly!D147=\"\",\"\",Finance_yearly!D147)","v":""},{"$f":"IF(Finance_yearly!E147=\"\",\"\",Finance_yearly!E147)","v":""},{"$f":"IF(Finance_yearly!F147=\"\",\"\",Finance_yearly!F147)","v":""},{"$f":"IF(Finance_yearly!G147=\"\",\"\",Finance_yearly!G147)","v":""}]
[null,null,null,null,null,null,null,null,null,null,null,null,null,null,null,null,null,null,null,null,null,null,null,{"$f":"IF(Finance_yearly!B148=\"\",\"\",Finance_yearly!B148)","v":""},{"$f":"IF(Finance_yearly!C148=\"\",\"\",Finance_yearly!C148)","v":""},{"$f":"IF(Finance_yearly!D148=\"\",\"\",Finance_yearly!D148)","v":""},{"$f":"IF(Finance_yearly!E148=\"\",\"\",Finance_yearly!E148)","v":""},{"$f":"IF(Finance_yearly!F148=\"\",\"\",Finance_yearly!F148)","v":""},{"$f":"IF(Finance_yearly!G148=\"\",\"\",Finance_yearly!G148)","v":""}]
[null,null,null,null,null,null,null,null,null,null,null,null,null,null,null,null,null,null,null,null,null,null,null,{"$f":"IF(Finance_yearly!B149=\"\",\"\",Finance_yearly!B149)","v":""},{"$f":"IF(Finance_yearly!C149=\"\",\"\",Finance_yearly!C149)","v":""},{"$f":"IF(Finance_yearly!D149=\"\",\"\",Finance_yearly!D149)","v":""},{"$f":"IF(Finance_yearly!E149=\"\",\"\",Finance_yearly!E149)","v":""},{"$f":"IF(Finance_yearly!F149=\"\",\"\",Finance_yearly!F149)","v":""},{"$f":"IF(Finance_yearly!G149=\"\",\"\",Finance_yearly!G149)","v":""}]
[null,null,null,null,null,null,null,null,null,null,null,null,null,null,null,null,null,null,null,null,null,null,null,{"$f":"IF(Finance_yearly!B150=\"\",\"\",Finance_yearly!B150)","v":""},{"$f":"IF(Finance_yearly!C150=\"\",\"\",Finance_yearly!C150)","v":""},{"$f":"IF(Finance_yearly!D150=\"\",\"\",Finance_yearly!D150)","v":""},{"$f":"IF(Finance_yearly!E150=\"\",\"\",Finance_yearly!E150)","v":""},{"$f":"IF(Finance_yearly!F150=\"\",\"\",Finance_yearly!F150)","v":""},{"$f":"IF(Finance_yearly!G150=\"\",\"\",Finance_yearly!G150)","v":""}]
[null,null,null,null,null,null,null,null,null,null,null,null,null,null,null,null,null,null,null,null,null,null,{"$f":"IF(Finance_yearly!A151=\"\",\"\",Finance_yearly!A151)","v":""},{"$f":"IF(Finance_yearly!B151=\"\",\"\",Finance_yearly!B151)","v":""},{"$f":"IF(Finance_yearly!C151=\"\",\"\",Finance_yearly!C151)","v":""},{"$f":"IF(Finance_yearly!D151=\"\",\"\",Finance_yearly!D151)","v":""},{"$f":"IF(Finance_yearly!E151=\"\",\"\",Finance_yearly!E151)","v":""},{"$f":"IF(Finance_yearly!F151=\"\",\"\",Finance_yearly!F151)","v":""},{"$f":"IF(Finance_yearly!G151=\"\",\"\",Finance_yearly!G151)","v":""}]
[null,null,null,null,null,null,null,null,null,null,null,null,null,null,null,null,null,null,null,null,null,null,{"$f":"IF(Finance_yearly!A152=\"\",\"\",Finance_yearly!A152)","v":""},{"$f":"IF(Finance_yearly!B152=\"\",\"\",Finance_yearly!B152)","v":""},{"$f":"IF(Finance_yearly!C152=\"\",\"\",Finance_yearly!C152)","v":""},{"$f":"IF(Finance_yearly!D152=\"\",\"\",Finance_yearly!D152)","v":""},{"$f":"IF(Finance_yearly!E152=\"\",\"\",Finance_yearly!E152)","v":""},{"$f":"IF(Finance_yearly!F152=\"\",\"\",Finance_yearly!F152)","v":""},{"$f":"IF(Finance_yearly!G152=\"\",\"\",Finance_yearly!G152)","v":""}]
[null,null,null,null,null,null,null,null,null,null,null,null,null,null,null,null,null,null,null,null,null,null,{"$f":"IF(Finance_yearly!A153=\"\",\"\",Finance_yearly!A153)","v":""},{"$f":"IF(Finance_yearly!B153=\"\",\"\",Finance_yearly!B153)","v":""},{"$f":"IF(Finance_yearly!C153=\"\",\"\",Finance_yearly!C153)","v":""},{"$f":"IF(Finance_yearly!D153=\"\",\"\",Finance_yearly!D153)","v":""},{"$f":"IF(Finance_yearly!E153=\"\",\"\",Finance_yearly!E153)","v":""},{"$f":"IF(Finance_yearly!F153=\"\",\"\",Finance_yearly!F153)","v":""},{"$f":"IF(Finance_yearly!G153=\"\",\"\",Finance_yearly!G153)","v":""}]
[]
[]
[]
[null,null,null,null,null,null,null,null,10]
[null,null,null,null,null,null,null,null,6]
[]
[]
[null,null,null,null,null,null,null,null,5]

{"sheet":"Attribute","index":1,"n_rows":3,"n_cols":70,"rows_kept":3,"cut":false,"hidden":false,"merged":[]}
["7203 Toyota"]
["公司英文簡稱","公司英文全稱","金融廳代碼","國際證券辨識碼","東証市場名","上市日(東証)","下市日(東証)","下市理由(東証)","大証市場名","上市日(大証)","下市日(大証)","下市理由(大証)","名古屋市場名","上市日(名古屋)","下市日(名古屋)","下市理由(名古屋)","福岡市場名","上市日(福岡)","下市日(福岡)","下市理由(福岡)","札幌市場名","上市日(札幌)","下市日(札幌)","下市理由(札幌)","會計月制","面額","面額單位","買賣單位","設立日","國家別","電話","傳真","網址","郵遞區號","地址","SICC行業別(中分類)","SICC行業別(大分類)","主營業務 1","主營業務 2","主營業務 3","主營業務 4","主營業務 5","主營業務 6","郵遞區號-聯絡地址","最近的聯絡地址","事務聯絡人電話","監理(審查中) 1","監理(審查中) 2","監理(確認中) 1","監理(確認中) 2","監理(確認中) 3","開示注意 1","開示注意 2","特設注意 1","寬限期間 1","寬限期間 2","寬限期間 3","日經225成分股","日經300成分股","日經500平均成分股","日經JAPAN1000成分股","日經中國關聯50成分股","JPX-Nikkei 400成分股","TOPIX新指數成分股","TOPIX 1000成分股","TOPIX成分1500成分股","東証Mothers Core成分","TOPIX亞洲關聯成分股","J-Stock Index成分股","JASDAQ-Top20成分股"]
["Toyota","Toyota Motor Corporation","E02144","JP3633400001","TPMJ    Tokyo Prime Market","1949-05-16",null,null,"OS1J    Osaka First Section","1949-05-14","2013-07-16","Change of Marketplace","NPMJ    Nagoya Premier Market","1949-05-16",null,null,"FSSJ    Fukuoka Main Market","1958-04-25","2018-01-06","Application for delisting or withdrawal of registration of a stock","SSSJ    Sapporo Main Market","1964-09-01","2018-01-06","Application for delisting or withdrawal of registration of a stock","0331",null,null,100,"1937-08-28","JP    JAPAN","(81)-565-28-2121",null,"http://www.toyota.co.jp/","471-8571","1, Toyota-cho, Toyota City, Aichi Pref.","S3700 運輸設備","S3 製造業","Automobiles, Finance, Others.",null,null,null,null,null,"112-8701","1-4-18, Koraku, Bunkyo-ku, Tokyo Metro.","03-3817-7111",null,null,null,null,null,null,null,null,null,null,null,"V","V","V","V","V","V","TOPIX New Index Series-TOPIX Core 30","V","V"]

{"sheet":"Equity","index":2,"n_rows":302,"n_cols":32,"rows_kept":302,"cut":false,"hidden":false,"merged":[[0,27,0,31],[0,22,0,26]]}
["7203 Toyota",null,null,null,null,null,null,null,"NIK225 Nikkei 225",null,null,null,null,null,null,null,null,null,null,null,null,null,"PE",null,null,null,null,"PB"]
[null,"年月日","成交量(個股)","收盤價(元)","報酬率％","PE","PB",null,"年月日","成交量(個股)","收盤價(元)","報酬率％",null,null,null,"Data Field","2023-07-21",null,null,null,null,null,5,10,15,20,25,0.5,1,2,3,4]
[{"$f":"IF(ROUNDUP((MONTH(B3)/3)-1,0)<=0,YEAR(B3)-1&\"Q4\",YEAR(B3)&\"Q\"&(ROUNDUP((MONTH(B3)/3)-1,0)))","v":"2012Q2"},"2012-07-31",null,null,null,{"$f":"D3/VLOOKUP($A3,$O$19:$S$38,5,0)","v":{"$error":"#DIV/0!"}},{"$f":"D3/VLOOKUP($A3,$O$19:$S$38,4,0)","v":{"$error":"#DIV/0!"}},null,"2012-07-31",null,null,null,null,null,null,"收盤價(元)",2287.5,null,null,null,null,null,{"$f":"W2&\"*PE\"","v":"5*PE"},{"$f":"X2&\"*PE\"","v":"10*PE"},{"$f":"Y2&\"*PE\"","v":"15*PE"},{"$f":"Z2&\"*PE\"","v":"20*PE"},{"$f":"AA2&\"*PE\"","v":"25*PE"},{"$f":"AB2&\"*\"&\"PB\"","v":"0.5*PB"},{"$f":"AC2&\"*\"&\"PB\"","v":"1*PB"},{"$f":"AD2&\"*\"&\"PB\"","v":"2*PB"},{"$f":"AE2&\"*\"&\"PB\"","v":"3*PB"},{"$f":"AF2&\"*\"&\"PB\"","v":"4*PB"}]
["2012Q2","2012-08-31",null,null,null,{"$f":"D4/VLOOKUP($A4,$O$19:$S$38,5,0)","v":{"$error":"#DIV/0!"}},{"$error":"#DIV/0!"},null,"2012-08-31",null,null,null,null,null,null,"日報酬率 %",2.1899999999999999E-2,null,null,null,null,{"$f":"B3","v":"2012-07-31"},{"$f":"W$2*D3/F3","v":{"$error":"#DIV/0!"}},{"$f":"X$2*$D3/$F3","v":{"$error":"#DIV/0!"}},{"$f":"Y$2*$D3/$F3","v":{"$error":"#DIV/0!"}},{"$f":"Z$2*$D3/$F3","v":{"$error":"#DIV/0!"}},{"$f":"AA$2*$D3/$F3","v":{"$error":"#DIV/0!"}},{"$f":"AB$2*$D3/$G3","v":{"$error":"#DIV/0!"}},{"$f":"AC$2*$D3/$G3","v":{"$error":"#DIV/0!"}},{"$f":"AD$2*$D3/$G3","v":{"$error":"#DIV/0!"}},{"$f":"AE$2*$D3/$G3","v":{"$error":"#DIV/0!"}},{"$f":"AF$2*$D3/$G3","v":{"$error":"#DIV/0!"}}]
["2012Q2","2012-09-28",null,null,null,{"$error":"#DIV/0!"},{"$error":"#DIV/0!"},null,"2012-09-28",null,null,null,null,null,null,"週報酬率 %",3.1335000000000002,null,null,null,null,"2012-08-31",{"$f":"W$2*D4/F4","v":{"$error":"#DIV/0!"}},{"$error":"#DIV/0!"},{"$error":"#DIV/0!"},{"$error":"#DIV/0!"},{"$error":"#DIV/0!"},{"$error":"#DIV/0!"},{"$error":"#DIV/0!"},{"$error":"#DIV/0!"},{"$error":"#DIV/0!"},{"$error":"#DIV/0!"}]
["2012Q3","2012-10-31",null,null,null,{"$error":"#DIV/0!"},{"$error":"#DIV/0!"},null,"2012-10-31",null,null,null,null,null,null,"月報酬率 %",3.1103000000000001,null,null,null,null,"2012-09-28",{"$f":"W$2*D5/F5","v":{"$error":"#DIV/0!"}},{"$error":"#DIV/0!"},{"$error":"#DIV/0!"},{"$error":"#DIV/0!"},{"$error":"#DIV/0!"},{"$error":"#DIV/0!"},{"$error":"#DIV/0!"},{"$error":"#DIV/0!"},{"$error":"#DIV/0!"},{"$error":"#DIV/0!"}]
["2012Q3","2012-11-30",null,null,null,{"$error":"#DIV/0!"},{"$error":"#DIV/0!"},null,"2012-11-30",null,null,null,null,null,null,"年報酬率 %",7.6234999999999999,null,null,null,null,"2012-10-31",{"$error":"#DIV/0!"},{"$error":"#DIV/0!"},{"$error":"#DIV/0!"},{"$error":"#DIV/0!"},{"$error":"#DIV/0!"},{"$error":"#DIV/0!"},{"$error":"#DIV/0!"},{"$error":"#DIV/0!"},{"$error":"#DIV/0!"},{"$error":"#DIV/0!"}]
["2012Q3","2012-12-28",null,null,null,{"$error":"#DIV/0!"},{"$error":"#DIV/0!"},null,"2012-12-28",null,null,null,null,null,null,null,null,null,null,null,null,"2012-11-30",{"$error":"#DIV/0!"},{"$error":"#DIV/0!"},{"$error":"#DIV/0!"},{"$error":"#DIV/0!"},{"$error":"#DIV/0!"},{"$error":"#DIV/0!"},{"$error":"#DIV/0!"},{"$error":"#DIV/0!"},{"$error":"#DIV/0!"},{"$error":"#DIV/0!"}]
["2012Q4","2013-01-31",null,null,null,{"$error":"#DIV/0!"},{"$error":"#DIV/0!"},null,"2013-01-31",null,null,null,null,null,null,null,null,null,null,null,null,"2012-12-28",{"$error":"#DIV/0!"},{"$error":"#DIV/0!"},{"$error":"#DIV/0!"},{"$error":"#DIV/0!"},{"$error":"#DIV/0!"},{"$error":"#DIV/0!"},{"$error":"#DIV/0!"},{"$error":"#DIV/0!"},{"$error":"#DIV/0!"},{"$error":"#DIV/0!"}]
["2012Q4","2013-02-28",null,null,null,{"$error":"#DIV/0!"},{"$error":"#DIV/0!"},null,"2013-02-28",null,null,null,null,null,null,null,null,null,null,null,null,"2013-01-31",{"$error":"#DIV/0!"},{"$error":"#DIV/0!"},{"$error":"#DIV/0!"},{"$error":"#DIV/0!"},{"$error":"#DIV/0!"},{"$error":"#DIV/0!"},{"$error":"#DIV/0!"},{"$error":"#DIV/0!"},{"$error":"#DIV/0!"},{"$error":"#DIV/0!"}]
["2012Q4","2013-03-29",null,null,null,{"$error":"#DIV/0!"},{"$error":"#DIV/0!"},null,"2013-03-29",null,null,null,null,null,null,"Data Field","2023-07-21",null,null,null,null,"2013-02-28",{"$error":"#DIV/0!"},{"$error":"#DIV/0!"},{"$error":"#DIV/0!"},{"$error":"#DIV/0!"},{"$error":"#DIV/0!"},{"$error":"#DIV/0!"},{"$error":"#DIV/0!"},{"$error":"#DIV/0!"},{"$error":"#DIV/0!"},{"$error":"#DIV/0!"}]
["2013Q1","2013-04-30",null,null,null,{"$error":"#DIV/0!"},{"$error":"#DIV/0!"},null,"2013-04-30",null,null,null,null,null,null,"收盤價(元)",32304.25,null,null,null,null,"2013-03-29",{"$error":"#DIV/0!"},{"$error":"#DIV/0!"},{"$error":"#DIV/0!"},{"$error":"#DIV/0!"},{"$error":"#DIV/0!"},{"$error":"#DIV/0!"},{"$error":"#DIV/0!"},{"$error":"#DIV/0!"},{"$error":"#DIV/0!"},{"$error":"#DIV/0!"}]
["2013Q1","2013-05-31",null,null,null,{"$error":"#DIV/0!"},{"$error":"#DIV/0!"},null,"2013-05-31",null,null,null,null,null,null,"日報酬率 %",-0.57330000000000003,null,null,null,null,"2013-04-30",{"$error":"#DIV/0!"},{"$error":"#DIV/0!"},{"$error":"#DIV/0!"},{"$error":"#DIV/0!"},{"$error":"#DIV/0!"},{"$error":"#DIV/0!"},{"$error":"#DIV/0!"},{"$error":"#DIV/0!"},{"$error":"#DIV/0!"},{"$error":"#DIV/0!"}]
["2013Q1","2013-06-28",null,null,null,{"$error":"#DIV/0!"},{"$error":"#DIV/0!"},null,"2013-06-28",null,null,null,null,null,null,"週報酬率 %",-0.26860000000000001,null,null,null,null,"2013-05-31",{"$error":"#DIV/0!"},{"$error":"#DIV/0!"},{"$error":"#DIV/0!"},{"$error":"#DIV/0!"},{"$error":"#DIV/0!"},{"$error":"#DIV/0!"},{"$error":"#DIV/0!"},{"$error":"#DIV/0!"},{"$error":"#DIV/0!"},{"$error":"#DIV/0!"}]
["2013Q2","2013-07-31",null,null,null,{"$error":"#DIV/0!"},{"$error":"#DIV/0!"},null,"2013-07-31",null,null,null,null,null,null,"月報酬率 %",-3.7854000000000001,null,null,null,null,"2013-06-28",{"$error":"#DIV/0!"},{"$error":"#DIV/0!"},{"$error":"#DIV/0!"},{"$error":"#DIV/0!"},{"$error":"#DIV/0!"},{"$error":"#DIV/0!"},{"$error":"#DIV/0!"},{"$error":"#DIV/0!"},{"$error":"#DIV/0!"},{"$error":"#DIV/0!"}]
["2013Q2","2013-08-30",null,null,null,{"$error":"#DIV/0!"},{"$error":"#DIV/0!"},null,"2013-08-30",null,null,null,null,null,null,"年報酬率 %",16.1905,null,null,null,null,"2013-07-31",{"$error":"#DIV/0!"},{"$error":"#DIV/0!"},{"$error":"#DIV/0!"},{"$error":"#DIV/0!"},{"$error":"#DIV/0!"},{"$error":"#DIV/0!"},{"$error":"#DIV/0!"},{"$error":"#DIV/0!"},{"$error":"#DIV/0!"},{"$error":"#DIV/0!"}]
["2013Q2","2013-09-30",null,null,null,{"$error":"#DIV/0!"},{"$error":"#DIV/0!"},null,"2013-09-30",null,null,null,null,null,null,null,null,null,null,null,null,"2013-08-30",{"$error":"#DIV/0!"},{"$error":"#DIV/0!"},{"$error":"#DIV/0!"},{"$error":"#DIV/0!"},{"$error":"#DIV/0!"},{"$error":"#DIV/0!"},{"$error":"#DIV/0!"},{"$error":"#DIV/0!"},{"$error":"#DIV/0!"},{"$error":"#DIV/0!"}]
["2013Q3","2013-10-31",null,null,null,{"$error":"#DIV/0!"},{"$error":"#DIV/0!"},null,"2013-10-31",null,null,null,null,null,null,"年月","每股盈餘－加權","每股稅前淨利","年化EPS",null,null,"2013-09-30",{"$error":"#DIV/0!"},{"$error":"#DIV/0!"},{"$error":"#DIV/0!"},{"$error":"#DIV/0!"},{"$error":"#DIV/0!"},{"$error":"#DIV/0!"},{"$error":"#DIV/0!"},{"$error":"#DIV/0!"},{"$error":"#DIV/0!"},{"$error":"#DIV/0!"}]
["2013Q3","2013-11-29",null,null,null,{"$error":"#DIV/0!"},{"$error":"#DIV/0!"},null,"2013-11-29",null,null,null,null,null,{"$f":"YEAR(P19)&\"Q\"&((MONTH(P19)/3))","v":"2017Q1"},"2017-03-31",null,null,{"$f":"SUM(Q19:Q22)/30*12","v":0},null,null,"2013-10-31",{"$error":"#DIV/0!"},{"$error":"#DIV/0!"},{"$error":"#DIV/0!"},{"$error":"#DIV/0!"},{"$error":"#DIV/0!"},{"$error":"#DIV/0!"},{"$error":"#DIV/0!"},{"$error":"#DIV/0!"},{"$error":"#DIV/0!"},{"$error":"#DIV/0!"}]
["2013Q3","2013-12-30",null,null,null,{"$error":"#DIV/0!"},{"$error":"#DIV/0!"},null,"2013-12-30",null,null,null,null,null,{"$f":"YEAR(P20)&\"Q\"&((MONTH(P20)/3))","v":"2016Q4"},"2016-12-30",null,null,0,null,null,"2013-11-29",{"$error":"#DIV/0!"},{"$error":"#DIV/0!"},{"$error":"#DIV/0!"},{"$error":"#DIV/0!"},{"$error":"#DIV/0!"},{"$error":"#DIV/0!"},{"$error":"#DIV/0!"},{"$error":"#DIV/0!"},{"$error":"#DIV/0!"},{"$error":"#DIV/0!"}]
["2013Q4","2014-01-31",null,null,null,{"$error":"#DIV/0!"},{"$error":"#DIV/0!"},null,"2014-01-31",null,null,null,null,null,"2016Q3","2016-09-30",null,null,0,null,null,"2013-12-30",{"$error":"#DIV/0!"},{"$error":"#DIV/0!"},{"$error":"#DIV/0!"},{"$error":"#DIV/0!"},{"$error":"#DIV/0!"},{"$error":"#DIV/0!"},{"$error":"#DIV/0!"},{"$error":"#DIV/0!"},{"$error":"#DIV/0!"},{"$error":"#DIV/0!"}]
["2013Q4","2014-02-28",null,null,null,{"$error":"#DIV/0!"},{"$error":"#DIV/0!"},null,"2014-02-28",null,null,null,null,null,"2016Q2","2016-06-30",null,null,0,null,null,"2014-01-31",{"$error":"#DIV/0!"},{"$error":"#DIV/0!"},{"$error":"#DIV/0!"},{"$error":"#DIV/0!"},{"$error":"#DIV/0!"},{"$error":"#DIV/0!"},{"$error":"#DIV/0!"},{"$error":"#DIV/0!"},{"$error":"#DIV/0!"},{"$error":"#DIV/0!"}]
["2013Q4","2014-03-31",null,null,null,{"$error":"#DIV/0!"},{"$error":"#DIV/0!"},null,"2014-03-31",null,null,null,null,null,"2016Q1","2016-03-31",null,null,0,null,null,"2014-02-28",{"$error":"#DIV/0!"},{"$error":"#DIV/0!"},{"$error":"#DIV/0!"},{"$error":"#DIV/0!"},{"$error":"#DIV/0!"},{"$error":"#DIV/0!"},{"$error":"#DIV/0!"},{"$error":"#DIV/0!"},{"$error":"#DIV/0!"},{"$error":"#DIV/0!"}]
["2014Q1","2014-04-30",null,null,null,{"$error":"#DIV/0!"},{"$error":"#DIV/0!"},null,"2014-04-30",null,null,null,null,null,"2015Q4","2015-12-30",null,null,0,null,null,"2014-03-31",{"$error":"#DIV/0!"},{"$error":"#DIV/0!"},{"$error":"#DIV/0!"},{"$error":"#DIV/0!"},{"$error":"#DIV/0!"},{"$error":"#DIV/0!"},{"$error":"#DIV/0!"},{"$error":"#DIV/0!"},{"$error":"#DIV/0!"},{"$error":"#DIV/0!"}]
["2014Q1","2014-05-30",null,null,null,{"$error":"#DIV/0!"},{"$error":"#DIV/0!"},null,"2014-05-30",null,null,null,null,null,"2015Q3","2015-09-30",null,null,0,null,null,"2014-04-30",{"$error":"#DIV/0!"},{"$error":"#DIV/0!"},{"$error":"#DIV/0!"},{"$error":"#DIV/0!"},{"$error":"#DIV/0!"},{"$error":"#DIV/0!"},{"$error":"#DIV/0!"},{"$error":"#DIV/0!"},{"$error":"#DIV/0!"},{"$error":"#DIV/0!"}]
["2014Q1","2014-06-30",null,null,null,{"$error":"#DIV/0!"},{"$error":"#DIV/0!"},null,"2014-06-30",null,null,null,null,null,"2015Q2","2015-06-30",null,null,0,null,null,"2014-05-30",{"$error":"#DIV/0!"},{"$error":"#DIV/0!"},{"$error":"#DIV/0!"},{"$error":"#DIV/0!"},{"$error":"#DIV/0!"},{"$error":"#DIV/0!"},{"$error":"#DIV/0!"},{"$error":"#DIV/0!"},{"$error":"#DIV/0!"},{"$error":"#DIV/0!"}]
["2014Q2","2014-07-31",null,null,null,{"$error":"#DIV/0!"},{"$error":"#DIV/0!"},null,"2014-07-31",null,null,null,null,null,"2015Q1","2015-03-31",null,null,0,null,null,"2014-06-30",{"$error":"#DIV/0!"},{"$error":"#DIV/0!"},{"$error":"#DIV/0!"},{"$error":"#DIV/0!"},{"$error":"#DIV/0!"},{"$error":"#DIV/0!"},{"$error":"#DIV/0!"},{"$error":"#DIV/0!"},{"$error":"#DIV/0!"},{"$error":"#DIV/0!"}]
["2014Q2","2014-08-29",null,null,null,{"$error":"#DIV/0!"},{"$error":"#DIV/0!"},null,"2014-08-29",null,null,null,null,null,"2014Q4","2014-12-30",null,null,0,null,null,"2014-07-31",{"$error":"#DIV/0!"},{"$error":"#DIV/0!"},{"$error":"#DIV/0!"},{"$error":"#DIV/0!"},{"$error":"#DIV/0!"},{"$error":"#DIV/0!"},{"$error":"#DIV/0!"},{"$error":"#DIV/0!"},{"$error":"#DIV/0!"},{"$error":"#DIV/0!"}]
["2014Q2","2014-09-30",null,null,null,{"$error":"#DIV/0!"},{"$error":"#DIV/0!"},null,"2014-09-30",null,null,null,null,null,"2014Q3","2014-09-30",null,null,0,null,null,"2014-08-29",{"$f":"W$2*D28/F28","v":{"$error":"#DIV/0!"}},{"$error":"#DIV/0!"},{"$error":"#DIV/0!"},{"$error":"#DIV/0!"},{"$error":"#DIV/0!"},{"$error":"#DIV/0!"},{"$error":"#DIV/0!"},{"$error":"#DIV/0!"},{"$error":"#DIV/0!"},{"$error":"#DIV/0!"}]
["2014Q3","2014-10-31",null,null,null,{"$error":"#DIV/0!"},{"$error":"#DIV/0!"},null,"2014-10-31",null,null,null,null,null,"2014Q2","2014-06-30",null,null,0,null,null,"2014-09-30",{"$error":"#DIV/0!"},{"$error":"#DIV/0!"},{"$error":"#DIV/0!"},{"$error":"#DIV/0!"},{"$error":"#DIV/0!"},{"$error":"#DIV/0!"},{"$error":"#DIV/0!"},{"$error":"#DIV/0!"},{"$error":"#DIV/0!"},{"$error":"#DIV/0!"}]
["2014Q3","2014-11-28",null,null,null,{"$error":"#DIV/0!"},{"$error":"#DIV/0!"},null,"2014-11-28",null,null,null,null,null,"2014Q1","2014-03-31",null,null,0,null,null,"2014-10-31",{"$error":"#DIV/0!"},{"$error":"#DIV/0!"},{"$error":"#DIV/0!"},{"$error":"#DIV/0!"},{"$error":"#DIV/0!"},{"$error":"#DIV/0!"},{"$error":"#DIV/0!"},{"$error":"#DIV/0!"},{"$error":"#DIV/0!"},{"$error":"#DIV/0!"}]
["2014Q3","2014-12-30",null,null,null,{"$error":"#DIV/0!"},{"$error":"#DIV/0!"},null,"2014-12-30",null,null,null,null,null,"2013Q4","2013-12-30",null,null,0,null,null,"2014-11-28",{"$error":"#DIV/0!"},{"$error":"#DIV/0!"},{"$error":"#DIV/0!"},{"$error":"#DIV/0!"},{"$error":"#DIV/0!"},{"$error":"#DIV/0!"},{"$error":"#DIV/0!"},{"$error":"#DIV/0!"},{"$error":"#DIV/0!"},{"$error":"#DIV/0!"}]
["2014Q4","2015-01-30",null,null,null,{"$error":"#DIV/0!"},{"$error":"#DIV/0!"},null,"2015-01-30",null,null,null,null,null,"2013Q3","2013-09-30",null,null,0,null,null,"2014-12-30",{"$error":"#DIV/0!"},{"$error":"#DIV/0!"},{"$error":"#DIV/0!"},{"$error":"#DIV/0!"},{"$error":"#DIV/0!"},{"$error":"#DIV/0!"},{"$error":"#DIV/0!"},{"$error":"#DIV/0!"},{"$error":"#DIV/0!"},{"$error":"#DIV/0!"}]
["2014Q4","2015-02-27",null,null,null,{"$error":"#DIV/0!"},{"$error":"#DIV/0!"},null,"2015-02-27",null,null,null,null,null,"2013Q2","2013-06-28",null,null,0,null,null,"2015-01-30",{"$error":"#DIV/0!"},{"$error":"#DIV/0!"},{"$error":"#DIV/0!"},{"$error":"#DIV/0!"},{"$error":"#DIV/0!"},{"$error":"#DIV/0!"},{"$error":"#DIV/0!"},{"$error":"#DIV/0!"},{"$error":"#DIV/0!"},{"$error":"#DIV/0!"}]
[{"$f":"IF(ROUNDUP((MONTH(B35)/3)-1,0)<=0,YEAR(B35)-1&\"Q4\",YEAR(B35)&\"Q\"&(ROUNDUP((MONTH(B35)/3)-1,0)))","v":"2014Q4"},"2015-03-31",null,null,null,{"$error":"#DIV/0!"},{"$error":"#DIV/0!"},null,"2015-03-31",null,null,null,null,null,"2013Q1","2013-03-29",null,null,0,null,null,"2015-02-27",{"$error":"#DIV/0!"},{"$error":"#DIV/0!"},{"$error":"#DIV/0!"},{"$error":"#DIV/0!"},{"$error":"#DIV/0!"},{"$error":"#DIV/0!"},{"$error":"#DIV/0!"},{"$error":"#DIV/0!"},{"$error":"#DIV/0!"},{"$error":"#DIV/0!"}]
["2015Q1","2015-04-30",null,null,null,{"$error":"#DIV/0!"},{"$error":"#DIV/0!"},null,"2015-04-30",null,null,null,null,null,"2012Q4","2012-12-28",null,null,0,null,null,{"$f":"B35","v":"2015-03-31"},{"$error":"#DIV/0!"},{"$f":"X$2*$D35/$F35","v":{"$error":"#DIV/0!"}},{"$f":"Y$2*$D35/$F35","v":{"$error":"#DIV/0!"}},{"$f":"Z$2*$D35/$F35","v":{"$error":"#DIV/0!"}},{"$f":"AA$2*$D35/$F35","v":{"$error":"#DIV/0!"}},{"$f":"AB$2*$D35/$G35","v":{"$error":"#DIV/0!"}},{"$f":"AC$2*$D35/$G35","v":{"$error":"#DIV/0!"}},{"$f":"AD$2*$D35/$G35","v":{"$error":"#DIV/0!"}},{"$f":"AE$2*$D35/$G35","v":{"$error":"#DIV/0!"}},{"$f":"AF$2*$D35/$G35","v":{"$error":"#DIV/0!"}}]
["2015Q1","2015-05-29",null,null,null,{"$error":"#DIV/0!"},{"$error":"#DIV/0!"},null,"2015-05-29",null,null,null,null,null,"2012Q3","2012-09-28",null,null,0,null,null,"2015-04-30",{"$error":"#DIV/0!"},{"$error":"#DIV/0!"},{"$error":"#DIV/0!"},{"$error":"#DIV/0!"},{"$error":"#DIV/0!"},{"$error":"#DIV/0!"},{"$error":"#DIV/0!"},{"$error":"#DIV/0!"},{"$error":"#DIV/0!"},{"$error":"#DIV/0!"}]
["2015Q1","2015-06-30",null,null,null,{"$error":"#DIV/0!"},{"$error":"#DIV/0!"},null,"2015-06-30",null,null,null,null,null,{"$f":"YEAR(P38)&\"Q\"&((MONTH(P38)/3))","v":"2012Q2"},"2012-06-29",null,null,0,null,null,"2015-05-29",{"$error":"#DIV/0!"},{"$error":"#DIV/0!"},{"$error":"#DIV/0!"},{"$error":"#DIV/0!"},{"$error":"#DIV/0!"},{"$error":"#DIV/0!"},{"$error":"#DIV/0!"},{"$error":"#DIV/0!"},{"$error":"#DIV/0!"},{"$error":"#DIV/0!"}]
["2015Q2","2015-07-31",null,null,null,{"$error":"#DIV/0!"},{"$error":"#DIV/0!"},null,"2015-07-31",null,null,null,null,null,"2012Q1","2012-03-30",null,null,{"$f":"SUM(Q39:Q45)/30*12","v":0},null,null,"2015-06-30",{"$error":"#DIV/0!"},{"$error":"#DIV/0!"},{"$error":"#DIV/0!"},{"$error":"#DIV/0!"},{"$error":"#DIV/0!"},{"$error":"#DIV/0!"},{"$error":"#DIV/0!"},{"$error":"#DIV/0!"},{"$error":"#DIV/0!"},{"$error":"#DIV/0!"}]
["2015Q2","2015-08-31",null,null,null,{"$error":"#DIV/0!"},{"$error":"#DIV/0!"},null,"2015-08-31",null,null,null,null,null,"2011Q4","2011-12-30",null,null,{"$f":"SUM(Q40:Q46)/30*12","v":0},null,null,"2015-07-31",{"$error":"#DIV/0!"},{"$error":"#DIV/0!"},{"$error":"#DIV/0!"},{"$error":"#DIV/0!"},{"$error":"#DIV/0!"},{"$error":"#DIV/0!"},{"$error":"#DIV/0!"},{"$error":"#DIV/0!"},{"$error":"#DIV/0!"},{"$error":"#DIV/0!"}]
["2015Q2","2015-09-30",null,null,null,{"$error":"#DIV/0!"},{"$error":"#DIV/0!"},null,"2015-09-30",null,null,null,null,null,"2011Q3","2011-09-30",null,null,{"$f":"SUM(Q41:Q47)/30*12","v":0},null,null,"2015-08-31",{"$error":"#DIV/0!"},{"$error":"#DIV/0!"},{"$error":"#DIV/0!"},{"$error":"#DIV/0!"},{"$error":"#DIV/0!"},{"$error":"#DIV/0!"},{"$error":"#DIV/0!"},{"$error":"#DIV/0!"},{"$error":"#DIV/0!"},{"$error":"#DIV/0!"}]
["2015Q3","2015-10-30",null,null,null,{"$error":"#DIV/0!"},{"$error":"#DIV/0!"},null,"2015-10-30",null,null,null,null,null,null,null,null,null,null,null,null,"2015-09-30",{"$error":"#DIV/0!"},{"$error":"#DIV/0!"},{"$error":"#DIV/0!"},{"$error":"#DIV/0!"},{"$error":"#DIV/0!"},{"$error":"#DIV/0!"},{"$error":"#DIV/0!"},{"$error":"#DIV/0!"},{"$error":"#DIV/0!"},{"$error":"#DIV/0!"}]
["2015Q3","2015-11-30",null,null,null,{"$error":"#DIV/0!"},{"$error":"#DIV/0!"},null,"2015-11-30",null,null,null,null,null,null,null,null,null,null,null,null,"2015-10-30",{"$error":"#DIV/0!"},{"$error":"#DIV/0!"},{"$error":"#DIV/0!"},{"$error":"#DIV/0!"},{"$error":"#DIV/0!"},{"$error":"#DIV/0!"},{"$error":"#DIV/0!"},{"$error":"#DIV/0!"},{"$error":"#DIV/0!"},{"$error":"#DIV/0!"}]
["2015Q3","2015-12-30",null,null,null,{"$error":"#DIV/0!"},{"$error":"#DIV/0!"},null,"2015-12-30",null,null,null,null,null,null,null,null,null,null,null,null,"2015-11-30",{"$error":"#DIV/0!"},{"$error":"#DIV/0!"},{"$error":"#DIV/0!"},{"$error":"#DIV/0!"},{"$error":"#DIV/0!"},{"$error":"#DIV/0!"},{"$error":"#DIV/0!"},{"$error":"#DIV/0!"},{"$error":"#DIV/0!"},{"$error":"#DIV/0!"}]
["2015Q4","2016-01-29",null,null,null,{"$error":"#DIV/0!"},{"$error":"#DIV/0!"},null,"2016-01-29",null,null,null,null,null,null,null,null,"4755 Rakuten","NIK225 Nikkei 225",null,null,"2015-12-30",{"$error":"#DIV/0!"},{"$error":"#DIV/0!"},{"$error":"#DIV/0!"},{"$error":"#DIV/0!"},{"$error":"#DIV/0!"},{"$error":"#DIV/0!"},{"$error":"#DIV/0!"},{"$error":"#DIV/0!"},{"$error":"#DIV/0!"},{"$error":"#DIV/0!"}]
["2015Q4","2016-02-29",null,null,null,{"$error":"#DIV/0!"},{"$error":"#DIV/0!"},null,"2016-02-29",null,null,null,null,null,null,null,"Data Field","2023-07-21","2023-07-21",null,null,"2016-01-29",{"$error":"#DIV/0!"},{"$error":"#DIV/0!"},{"$error":"#DIV/0!"},{"$error":"#DIV/0!"},{"$error":"#DIV/0!"},{"$error":"#DIV/0!"},{"$error":"#DIV/0!"},{"$error":"#DIV/0!"},{"$error":"#DIV/0!"},{"$error":"#DIV/0!"}]
["2015Q4","2016-03-31",null,null,null,{"$error":"#DIV/0!"},{"$error":"#DIV/0!"},null,"2016-03-31",null,null,null,null,null,null,null,"日報酬率 %",-0.2621,-0.57330000000000003,null,null,"2016-02-29",{"$error":"#DIV/0!"},{"$error":"#DIV/0!"},{"$error":"#DIV/0!"},{"$error":"#DIV/0!"},{"$error":"#DIV/0!"},{"$error":"#DIV/0!"},{"$error":"#DIV/0!"},{"$error":"#DIV/0!"},{"$error":"#DIV/0!"},{"$error":"#DIV/0!"}]
["2016Q1","2016-04-28",null,null,null,{"$error":"#DIV/0!"},{"$error":"#DIV/0!"},null,"2016-04-28",null,null,null,null,null,null,null,"本週以來報酬率 %",-5.1123000000000003,-0.26860000000000001,null,null,"2016-03-31",{"$error":"#DIV/0!"},{"$error":"#DIV/0!"},{"$error":"#DIV/0!"},{"$error":"#DIV/0!"},{"$error":"#DIV/0!"},{"$error":"#DIV/0!"},{"$error":"#DIV/0!"},{"$error":"#DIV/0!"},{"$error":"#DIV/0!"},{"$error":"#DIV/0!"}]
["2016Q1","2016-05-31",null,null,null,{"$error":"#DIV/0!"},{"$error":"#DIV/0!"},null,"2016-05-31",null,null,null,null,null,null,null,"本月以來報酬率 %",6.7534000000000001,-2.6659999999999999,null,null,"2016-04-28",{"$error":"#DIV/0!"},{"$error":"#DIV/0!"},{"$error":"#DIV/0!"},{"$error":"#DIV/0!"},{"$error":"#DIV/0!"},{"$error":"#DIV/0!"},{"$error":"#DIV/0!"},{"$error":"#DIV/0!"},{"$error":"#DIV/0!"},{"$error":"#DIV/0!"}]
["2016Q1","2016-06-30",null,null,null,{"$error":"#DIV/0!"},{"$error":"#DIV/0!"},null,"2016-06-30",null,null,null,null,null,null,null,"本季以來報酬率 %",6.7534000000000001,-2.6659999999999999,null,null,"2016-05-31",{"$error":"#DIV/0!"},{"$error":"#DIV/0!"},{"$error":"#DIV/0!"},{"$error":"#DIV/0!"},{"$error":"#DIV/0!"},{"$error":"#DIV/0!"},{"$error":"#DIV/0!"},{"$error":"#DIV/0!"},{"$error":"#DIV/0!"},{"$error":"#DIV/0!"}]
["2016Q2","2016-07-29",null,null,null,{"$error":"#DIV/0!"},{"$error":"#DIV/0!"},null,"2016-07-29",null,null,null,null,null,null,null,null,null,null,null,null,"2016-06-30",{"$error":"#DIV/0!"},{"$error":"#DIV/0!"},{"$error":"#DIV/0!"},{"$error":"#DIV/0!"},{"$error":"#DIV/0!"},{"$error":"#DIV/0!"},{"$error":"#DIV/0!"},{"$error":"#DIV/0!"},{"$error":"#DIV/0!"},{"$error":"#DIV/0!"}]
["2016Q2","2016-08-31",null,null,null,{"$error":"#DIV/0!"},{"$error":"#DIV/0!"},null,"2016-08-31",null,null,null,null,null,null,null,null,null,null,null,null,"2016-07-29",{"$error":"#DIV/0!"},{"$error":"#DIV/0!"},{"$error":"#DIV/0!"},{"$error":"#DIV/0!"},{"$error":"#DIV/0!"},{"$error":"#DIV/0!"},{"$error":"#DIV/0!"},{"$error":"#DIV/0!"},{"$error":"#DIV/0!"},{"$error":"#DIV/0!"}]
["2016Q2","2016-09-30",null,null,null,{"$error":"#DIV/0!"},{"$error":"#DIV/0!"},null,"2016-09-30",null,null,null,null,null,"年月日","收盤價(元)","成交量(個股)",null,"年月日","收盤價(元)",null,"2016-08-31",{"$error":"#DIV/0!"},{"$error":"#DIV/0!"},{"$error":"#DIV/0!"},{"$error":"#DIV/0!"},{"$error":"#DIV/0!"},{"$error":"#DIV/0!"},{"$error":"#DIV/0!"},{"$error":"#DIV/0!"},{"$error":"#DIV/0!"},{"$error":"#DIV/0!"}]
["2016Q3","2016-10-31",null,null,null,{"$error":"#DIV/0!"},{"$error":"#DIV/0!"},null,"2016-10-31",null,null,null,null,null,"2017-01-05",null,null,null,"2023-07-21","1906-04-05T12:00:00",null,"2016-09-30",{"$error":"#DIV/0!"},{"$error":"#DIV/0!"},{"$error":"#DIV/0!"},{"$error":"#DIV/0!"},{"$error":"#DIV/0!"},{"$error":"#DIV/0!"},{"$error":"#DIV/0!"},{"$error":"#DIV/0!"},{"$error":"#DIV/0!"},{"$error":"#DIV/0!"}]
["2016Q3","2016-11-30",null,null,null,{"$error":"#DIV/0!"},{"$error":"#DIV/0!"},null,"2016-11-30",null,null,null,null,null,"2017-01-06",null,null,null,null,null,null,"2016-10-31",{"$error":"#DIV/0!"},{"$error":"#DIV/0!"},{"$error":"#DIV/0!"},{"$error":"#DIV/0!"},{"$error":"#DIV/0!"},{"$error":"#DIV/0!"},{"$error":"#DIV/0!"},{"$error":"#DIV/0!"},{"$error":"#DIV/0!"},{"$error":"#DIV/0!"}]
["2016Q3","2016-12-30",null,null,null,{"$error":"#DIV/0!"},{"$error":"#DIV/0!"},null,"2016-12-30",null,null,null,null,null,"2017-01-10",null,null,null,null,null,null,"2016-11-30",{"$error":"#DIV/0!"},{"$error":"#DIV/0!"},{"$error":"#DIV/0!"},{"$error":"#DIV/0!"},{"$error":"#DIV/0!"},{"$error":"#DIV/0!"},{"$error":"#DIV/0!"},{"$error":"#DIV/0!"},{"$error":"#DIV/0!"},{"$error":"#DIV/0!"}]
["2016Q4","2017-01-31",null,null,null,{"$error":"#DIV/0!"},{"$error":"#DIV/0!"},null,"2017-01-31",null,null,null,null,null,"2017-01-11",null,null,null,null,null,null,"2016-12-30",{"$error":"#DIV/0!"},{"$error":"#DIV/0!"},{"$error":"#DIV/0!"},{"$error":"#DIV/0!"},{"$error":"#DIV/0!"},{"$error":"#DIV/0!"},{"$error":"#DIV/0!"},{"$error":"#DIV/0!"},{"$error":"#DIV/0!"},{"$error":"#DIV/0!"}]
["2016Q4","2017-02-28",null,null,null,{"$error":"#DIV/0!"},{"$error":"#DIV/0!"},null,"2017-02-28",null,null,null,null,null,"2017-01-12",null,null,null,null,null,null,"2017-01-31",{"$error":"#DIV/0!"},{"$error":"#DIV/0!"},{"$error":"#DIV/0!"},{"$error":"#DIV/0!"},{"$error":"#DIV/0!"},{"$error":"#DIV/0!"},{"$error":"#DIV/0!"},{"$error":"#DIV/0!"},{"$error":"#DIV/0!"},{"$error":"#DIV/0!"}]
["2016Q4","2017-03-31",null,null,null,{"$error":"#DIV/0!"},{"$error":"#DIV/0!"},null,"2017-03-31",null,null,null,null,null,"2017-01-13",null,null,null,null,null,null,"2017-02-28",{"$error":"#DIV/0!"},{"$error":"#DIV/0!"},{"$error":"#DIV/0!"},{"$error":"#DIV/0!"},{"$error":"#DIV/0!"},{"$error":"#DIV/0!"},{"$error":"#DIV/0!"},{"$error":"#DIV/0!"},{"$error":"#DIV/0!"},{"$error":"#DIV/0!"}]
["2017Q1","2017-04-28",null,null,null,{"$error":"#DIV/0!"},{"$error":"#DIV/0!"},null,"2017-04-28",null,null,null,null,null,"2017-01-16",null,null,null,null,null,null,"2017-03-31",{"$error":"#DIV/0!"},{"$error":"#DIV/0!"},{"$error":"#DIV/0!"},{"$error":"#DIV/0!"},{"$error":"#DIV/0!"},{"$error":"#DIV/0!"},{"$error":"#DIV/0!"},{"$error":"#DIV/0!"},{"$error":"#DIV/0!"},{"$error":"#DIV/0!"}]
["2017Q1","2017-05-31",null,null,null,{"$error":"#DIV/0!"},{"$error":"#DIV/0!"},null,"2017-05-31",null,null,null,null,null,"2017-01-17",null,null,null,null,null,null,"2017-04-28",{"$error":"#DIV/0!"},{"$error":"#DIV/0!"},{"$error":"#DIV/0!"},{"$error":"#DIV/0!"},{"$error":"#DIV/0!"},{"$error":"#DIV/0!"},{"$error":"#DIV/0!"},{"$error":"#DIV/0!"},{"$error":"#DIV/0!"},{"$error":"#DIV/0!"}]
["2017Q1","2017-06-30",null,null,null,{"$error":"#DIV/0!"},{"$error":"#DIV/0!"},null,"2017-06-30",null,null,null,null,null,"2017-01-18",null,null,null,null,null,null,"2017-05-31",{"$error":"#DIV/0!"},{"$error":"#DIV/0!"},{"$error":"#DIV/0!"},{"$error":"#DIV/0!"},{"$error":"#DIV/0!"},{"$error":"#DIV/0!"},{"$error":"#DIV/0!"},{"$error":"#DIV/0!"},{"$error":"#DIV/0!"},{"$error":"#DIV/0!"}]
[null,null,null,null,null,null,null,null,"2017-07-04",null,null,null,null,null,"2017-01-19",null,null,null,null,null,null,"2017-06-30",{"$error":"#DIV/0!"},{"$error":"#DIV/0!"},{"$error":"#DIV/0!"},{"$error":"#DIV/0!"},{"$error":"#DIV/0!"},{"$error":"#DIV/0!"},{"$error":"#DIV/0!"},{"$error":"#DIV/0!"},{"$error":"#DIV/0!"},{"$error":"#DIV/0!"}]
[null,null,null,null,null,null,null,null,null,null,null,null,null,null,"2017-01-20"]
[null,null,null,null,null,null,null,null,null,null,null,null,null,null,"2017-01-23"]
[null,null,null,null,null,null,null,null,null,null,null,null,null,null,"2017-01-24"]
[null,null,null,null,null,null,null,null,null,null,null,null,null,null,"2017-01-25"]
[null,null,null,null,null,null,null,null,null,null,null,null,null,null,"2017-01-26"]
[null,null,null,null,null,null,null,null,null,null,null,null,null,null,"2017-01-27"]
[null,null,null,null,null,null,null,null,null,null,null,null,null,null,"2017-01-30"]
[null,null,null,null,null,null,null,null,null,null,null,null,null,null,"2017-01-31"]
[null,null,null,null,null,null,null,null,null,null,null,null,null,null,"2017-02-01"]
[null,null,null,null,null,null,null,null,null,null,null,null,null,null,"2017-02-02"]
[null,null,null,null,null,null,null,null,null,null,null,null,null,null,"2017-02-03"]
[null,null,null,null,null,null,null,null,null,null,null,null,null,null,"2017-02-06"]
[null,null,null,null,null,null,null,null,null,null,null,null,null,null,"2017-02-07"]
[null,null,null,null,null,null,null,null,null,null,null,null,null,null,"2017-02-08"]
[null,null,null,null,null,null,null,null,null,null,null,null,null,null,"2017-02-09"]
[null,null,null,null,null,null,null,null,null,null,null,null,null,null,"2017-02-10"]
[null,null,null,null,null,null,null,null,null,null,null,null,null,null,"2017-02-13"]
[null,null,null,null,null,null,null,null,null,null,null,null,null,null,"2017-02-14"]
[null,null,null,null,null,null,null,null,null,null,null,null,null,null,"2017-02-15"]
[null,null,null,null,null,null,null,null,null,null,null,null,null,null,"2017-02-16"]
[null,null,null,null,null,null,null,null,null,null,null,null,null,null,"2017-02-17"]
[null,null,null,null,null,null,null,null,null,null,null,null,null,null,"2017-02-20"]
[null,null,null,null,null,null,null,null,null,null,null,null,null,null,"2017-02-21"]
[null,null,null,null,null,null,null,null,null,null,null,null,null,null,"2017-02-22"]
[null,null,null,null,null,null,null,null,null,null,null,null,null,null,"2017-02-23"]
[null,null,null,null,null,null,null,null,null,null,null,null,null,null,"2017-02-24"]
[null,null,null,null,null,null,null,null,null,null,null,null,null,null,"2017-02-27"]
[null,null,null,null,null,null,null,null,null,null,null,null,null,null,"2017-02-28"]
[null,null,null,null,null,null,null,null,null,null,null,null,null,null,"2017-03-01"]
[null,null,null,null,null,null,null,null,null,null,null,null,null,null,"2017-03-02"]
[null,null,null,null,null,null,null,null,null,null,null,null,null,null,"2017-03-03"]
[null,null,null,null,null,null,null,null,null,null,null,null,null,null,"2017-03-06"]
[null,null,null,null,null,null,null,null,null,null,null,null,null,null,"2017-03-07"]
[null,null,null,null,null,null,null,null,null,null,null,null,null,null,"2017-03-08"]
[null,null,null,null,null,null,null,null,null,null,null,null,null,null,"2017-03-09"]
[null,null,null,null,null,null,null,null,null,null,null,null,null,null,"2017-03-10"]
[null,null,null,null,null,null,null,null,null,null,null,null,null,null,"2017-03-13"]
[null,null,null,null,null,null,null,null,null,null,null,null,null,null,"2017-03-14"]
[null,null,null,null,null,null,null,null,null,null,null,null,null,null,"2017-03-15"]
[null,null,null,null,null,null,null,null,null,null,null,null,null,null,"2017-03-16"]
[null,null,null,null,null,null,null,null,null,null,null,null,null,null,"2017-03-17"]
[null,null,null,null,null,null,null,null,null,null,null,null,null,null,"2017-03-21"]
[null,null,null,null,null,null,null,null,null,null,null,null,null,null,"2017-03-22"]
[null,null,null,null,null,null,null,null,null,null,null,null,null,null,"2017-03-23"]
[null,null,null,null,null,null,null,null,null,null,null,null,null,null,"2017-03-24"]
[null,null,null,null,null,null,null,null,null,null,null,null,null,null,"2017-03-27"]
[null,null,null,null,null,null,null,null,null,null,null,null,null,null,"2017-03-28"]
[null,null,null,null,null,null,null,null,null,null,null,null,null,null,"2017-03-29"]
[null,null,null,null,null,null,null,null,null,null,null,null,null,null,"2017-03-30"]
[null,null,null,null,null,null,null,null,null,null,null,null,null,null,"2017-03-31"]
[null,null,null,null,null,null,null,null,null,null,null,null,null,null,"2017-04-03"]
[null,null,null,null,null,null,null,null,null,null,null,null,null,null,"2017-04-04"]
[null,null,null,null,null,null,null,null,null,null,null,null,null,null,"2017-04-05"]
[null,null,null,null,null,null,null,null,null,null,null,null,null,null,"2017-04-06"]
[null,null,null,null,null,null,null,null,null,null,null,null,null,null,"2017-04-07"]
[null,null,null,null,null,null,null,null,null,null,null,null,null,null,"2017-04-10"]
[null,null,null,null,null,null,null,null,null,null,null,null,null,null,"2017-04-11"]
[null,null,null,null,null,null,null,null,null,null,null,null,null,null,"2017-04-12"]
[null,null,null,null,null,null,null,null,null,null,null,null,null,null,"2017-04-13"]
[null,null,null,null,null,null,null,null,null,null,null,null,null,null,"2017-04-14"]
[null,null,null,null,null,null,null,null,null,null,null,null,null,null,"2017-04-17"]
[null,null,null,null,null,null,null,null,null,null,null,null,null,null,"2017-04-18"]
[null,null,null,null,null,null,null,null,null,null,null,null,null,null,"2017-04-19"]
[null,null,null,null,null,null,null,null,null,null,null,null,null,null,"2017-04-20"]
[null,null,null,null,null,null,null,null,null,null,null,null,null,null,"2017-04-21"]
[null,null,null,null,null,null,null,null,null,null,null,null,null,null,"2017-04-24"]
[null,null,null,null,null,null,null,null,null,null,null,null,null,null,"2017-04-25"]
[null,null,null,null,null,null,null,null,null,null,null,null,null,null,"2017-04-26"]
[null,null,null,null,null,null,null,null,null,null,null,null,null,null,"2017-04-27"]
[null,null,null,null,null,null,null,null,null,null,null,null,null,null,"2017-04-28"]
[null,null,null,null,null,null,null,null,null,null,null,null,null,null,"2017-05-01"]
[null,null,null,null,null,null,null,null,null,null,null,null,null,null,"2017-05-02"]
[null,null,null,null,null,null,null,null,null,null,null,null,null,null,"2017-05-08"]
[null,null,null,null,null,null,null,null,null,null,null,null,null,null,"2017-05-09"]
[null,null,null,null,null,null,null,null,null,null,null,null,null,null,"2017-05-10"]
[null,null,null,null,null,null,null,null,null,null,null,null,null,null,"2017-05-11"]
[null,null,null,null,null,null,null,null,null,null,null,null,null,null,"2017-05-12"]
[null,null,null,null,null,null,null,null,null,null,null,null,null,null,"2017-05-15"]
[null,null,null,null,null,null,null,null,null,null,null,null,null,null,"2017-05-16"]
[null,null,null,null,null,null,null,null,null,null,null,null,null,null,"2017-05-17"]
[null,null,null,null,null,null,null,null,null,null,null,null,null,null,"2017-05-18"]
[null,null,null,null,null,null,null,null,null,null,null,null,null,null,"2017-05-19"]
[null,null,null,null,null,null,null,null,null,null,null,null,null,null,"2017-05-22"]
[null,null,null,null,null,null,null,null,null,null,null,null,null,null,"2017-05-23"]
[null,null,null,null,null,null,null,null,null,null,null,null,null,null,"2017-05-24"]
[null,null,null,null,null,null,null,null,null,null,null,null,null,null,"2017-05-25"]
[null,null,null,null,null,null,null,null,null,null,null,null,null,null,"2017-05-26"]
[null,null,null,null,null,null,null,null,null,null,null,null,null,null,"2017-05-29"]
[null,null,null,null,null,null,null,null,null,null,null,null,null,null,"2017-05-30"]
[null,null,null,null,null,null,null,null,null,null,null,null,null,null,"2017-05-31"]
[null,null,null,null,null,null,null,null,null,null,null,null,null,null,"2017-06-01"]
[null,null,null,null,null,null,null,null,null,null,null,null,null,null,"2017-06-02"]
[null,null,null,null,null,null,null,null,null,null,null,null,null,null,"2017-06-05"]
[null,null,null,null,null,null,null,null,null,null,null,null,null,null,"2017-06-06"]
[null,null,null,null,null,null,null,null,null,null,null,null,null,null,"2017-06-07"]
[null,null,null,null,null,null,null,null,null,null,null,null,null,null,"2017-06-08"]
[null,null,null,null,null,null,null,null,null,null,null,null,null,null,"2017-06-09"]
[null,null,null,null,null,null,null,null,null,null,null,null,null,null,"2017-06-12"]
[null,null,null,null,null,null,null,null,null,null,null,null,null,null,"2017-06-13"]
[null,null,null,null,null,null,null,null,null,null,null,null,null,null,"2017-06-14"]
[null,null,null,null,null,null,null,null,null,null,null,null,null,null,"2017-06-15"]
[null,null,null,null,null,null,null,null,null,null,null,null,null,null,"2017-06-16"]
[null,null,null,null,null,null,null,null,null,null,null,null,null,null,"2017-06-19"]
[null,null,null,null,null,null,null,null,null,null,null,null,null,null,"2017-06-20"]
[null,null,null,null,null,null,null,null,null,null,null,null,null,null,"2017-06-21"]
[null,null,null,null,null,null,null,null,null,null,null,null,null,null,"2017-06-22"]
[null,null,null,null,null,null,null,null,null,null,null,null,null,null,"2017-06-23"]
[null,null,null,null,null,null,null,null,null,null,null,null,null,null,"2017-06-26"]
[null,null,null,null,null,null,null,null,null,null,null,null,null,null,"2017-06-27"]
[null,null,null,null,null,null,null,null,null,null,null,null,null,null,"2017-06-28"]
[null,null,null,null,null,null,null,null,null,null,null,null,null,null,"2017-06-29"]
[null,null,null,null,null,null,null,null,null,null,null,null,null,null,"2017-06-30"]
[null,null,null,null,null,null,null,null,null,null,null,null,null,null,"2017-07-03"]
[null,null,null,null,null,null,null,null,null,null,null,null,null,null,"2017-07-04"]
[null,null,null,null,null,null,null,null,null,null,null,null,null,null,null,"NIK225 Nikkei 225"]
[null,null,null,null,null,null,null,null,null,null,null,null,null,null,null,"年月日","成交量(個股)","收盤價(元)","報酬率％"]
[null,null,null,null,null,null,null,null,null,null,null,null,null,null,null,"2017-07-04"]
[null,null,null,null,null,null,null,null,null,null,null,null,null,null,null,"2017-07-03"]
[null,null,null,null,null,null,null,null,null,null,null,null,null,null,null,"2017-06-30"]
[null,null,null,null,null,null,null,null,null,null,null,null,null,null,null,"2017-06-29"]
[null,null,null,null,null,null,null,null,null,null,null,null,null,null,null,"2017-06-28"]
[null,null,null,null,null,null,null,null,null,null,null,null,null,null,null,"2017-06-27"]
[null,null,null,null,null,null,null,null,null,null,null,null,null,null,null,"2017-06-26"]
[null,null,null,null,null,null,null,null,null,null,null,null,null,null,null,"2017-06-23"]
[null,null,null,null,null,null,null,null,null,null,null,null,null,null,null,"2017-06-22"]
[null,null,null,null,null,null,null,null,null,null,null,null,null,null,null,"2017-06-21"]
[null,null,null,null,null,null,null,null,null,null,null,null,null,null,null,"2017-06-20"]
[null,null,null,null,null,null,null,null,null,null,null,null,null,null,null,"2017-06-19"]
[null,null,null,null,null,null,null,null,null,null,null,null,null,null,null,"2017-06-16"]
[null,null,null,null,null,null,null,null,null,null,null,null,null,null,null,"2017-06-15"]
[null,null,null,null,null,null,null,null,null,null,null,null,null,null,null,"2017-06-14"]
[null,null,null,null,null,null,null,null,null,null,null,null,null,null,null,"2017-06-13"]
[null,null,null,null,null,null,null,null,null,null,null,null,null,null,null,"2017-06-12"]
[null,null,null,null,null,null,null,null,null,null,null,null,null,null,null,"2017-06-09"]
[null,null,null,null,null,null,null,null,null,null,null,null,null,null,null,"2017-06-08"]
[null,null,null,null,null,null,null,null,null,null,null,null,null,null,null,"2017-06-07"]
[null,null,null,null,null,null,null,null,null,null,null,null,null,null,null,"2017-06-06"]
[null,null,null,null,null,null,null,null,null,null,null,null,null,null,null,"2017-06-05"]
[null,null,null,null,null,null,null,null,null,null,null,null,null,null,null,"2017-06-02"]
[null,null,null,null,null,null,null,null,null,null,null,null,null,null,null,"2017-06-01"]
[null,null,null,null,null,null,null,null,null,null,null,null,null,null,null,"2017-05-31"]
[null,null,null,null,null,null,null,null,null,null,null,null,null,null,null,"2017-05-30"]
[null,null,null,null,null,null,null,null,null,null,null,null,null,null,null,"2017-05-29"]
[null,null,null,null,null,null,null,null,null,null,null,null,null,null,null,"2017-05-26"]
[null,null,null,null,null,null,null,null,null,null,null,null,null,null,null,"2017-05-25"]
[null,null,null,null,null,null,null,null,null,null,null,null,null,null,null,"2017-05-24"]
[null,null,null,null,null,null,null,null,null,null,null,null,null,null,null,"2017-05-23"]
[null,null,null,null,null,null,null,null,null,null,null,null,null,null,null,"2017-05-22"]
[null,null,null,null,null,null,null,null,null,null,null,null,null,null,null,"2017-05-19"]
[null,null,null,null,null,null,null,null,null,null,null,null,null,null,null,"2017-05-18"]
[null,null,null,null,null,null,null,null,null,null,null,null,null,null,null,"2017-05-17"]
[null,null,null,null,null,null,null,null,null,null,null,null,null,null,null,"2017-05-16"]
[null,null,null,null,null,null,null,null,null,null,null,null,null,null,null,"2017-05-15"]
[null,null,null,null,null,null,null,null,null,null,null,null,null,null,null,"2017-05-12"]
[null,null,null,null,null,null,null,null,null,null,null,null,null,null,null,"2017-05-11"]
[null,null,null,null,null,null,null,null,null,null,null,null,null,null,null,"2017-05-10"]
[null,null,null,null,null,null,null,null,null,null,null,null,null,null,null,"2017-05-09"]
[null,null,null,null,null,null,null,null,null,null,null,null,null,null,null,"2017-05-08"]
[null,null,null,null,null,null,null,null,null,null,null,null,null,null,null,"2017-05-02"]
[null,null,null,null,null,null,null,null,null,null,null,null,null,null,null,"2017-05-01"]
[null,null,null,null,null,null,null,null,null,null,null,null,null,null,null,"2017-04-28"]
[null,null,null,null,null,null,null,null,null,null,null,null,null,null,null,"2017-04-27"]
[null,null,null,null,null,null,null,null,null,null,null,null,null,null,null,"2017-04-26"]
[null,null,null,null,null,null,null,null,null,null,null,null,null,null,null,"2017-04-25"]
[null,null,null,null,null,null,null,null,null,null,null,null,null,null,null,"2017-04-24"]
[null,null,null,null,null,null,null,null,null,null,null,null,null,null,null,"2017-04-21"]
[null,null,null,null,null,null,null,null,null,null,null,null,null,null,null,"2017-04-20"]
[null,null,null,null,null,null,null,null,null,null,null,null,null,null,null,"2017-04-19"]
[null,null,null,null,null,null,null,null,null,null,null,null,null,null,null,"2017-04-18"]
[null,null,null,null,null,null,null,null,null,null,null,null,null,null,null,"2017-04-17"]
[null,null,null,null,null,null,null,null,null,null,null,null,null,null,null,"2017-04-14"]
[null,null,null,null,null,null,null,null,null,null,null,null,null,null,null,"2017-04-13"]
[null,null,null,null,null,null,null,null,null,null,null,null,null,null,null,"2017-04-12"]
[null,null,null,null,null,null,null,null,null,null,null,null,null,null,null,"2017-04-11"]
[null,null,null,null,null,null,null,null,null,null,null,null,null,null,null,"2017-04-10"]
[null,null,null,null,null,null,null,null,null,null,null,null,null,null,null,"2017-04-07"]
[null,null,null,null,null,null,null,null,null,null,null,null,null,null,null,"2017-04-06"]
[null,null,null,null,null,null,null,null,null,null,null,null,null,null,null,"2017-04-05"]
[null,null,null,null,null,null,null,null,null,null,null,null,null,null,null,"2017-04-04"]
[null,null,null,null,null,null,null,null,null,null,null,null,null,null,null,"2017-03-31"]
[null,null,null,null,null,null,null,null,null,null,null,null,null,null,null,"2017-03-30"]
[null,null,null,null,null,null,null,null,null,null,null,null,null,null,null,"2017-03-29"]
[null,null,null,null,null,null,null,null,null,null,null,null,null,null,null,"2017-03-28"]
[null,null,null,null,null,null,null,null,null,null,null,null,null,null,null,"2017-03-27"]
[null,null,null,null,null,null,null,null,null,null,null,null,null,null,null,"2017-03-24"]
[null,null,null,null,null,null,null,null,null,null,null,null,null,null,null,"2017-03-23"]
[null,null,null,null,null,null,null,null,null,null,null,null,null,null,null,"2017-03-22"]
[null,null,null,null,null,null,null,null,null,null,null,null,null,null,null,"2017-03-21"]
[null,null,null,null,null,null,null,null,null,null,null,null,null,null,null,"2017-03-17"]
[null,null,null,null,null,null,null,null,null,null,null,null,null,null,null,"2017-03-16"]
[null,null,null,null,null,null,null,null,null,null,null,null,null,null,null,"2017-03-15"]
[null,null,null,null,null,null,null,null,null,null,null,null,null,null,null,"2017-03-14"]
[null,null,null,null,null,null,null,null,null,null,null,null,null,null,null,"2017-03-13"]
[null,null,null,null,null,null,null,null,null,null,null,null,null,null,null,"2017-03-10"]
[null,null,null,null,null,null,null,null,null,null,null,null,null,null,null,"2017-03-09"]
[null,null,null,null,null,null,null,null,null,null,null,null,null,null,null,"2017-03-08"]
[null,null,null,null,null,null,null,null,null,null,null,null,null,null,null,"2017-03-07"]
[null,null,null,null,null,null,null,null,null,null,null,null,null,null,null,"2017-03-06"]
[null,null,null,null,null,null,null,null,null,null,null,null,null,null,null,"2017-03-03"]
[null,null,null,null,null,null,null,null,null,null,null,null,null,null,null,"2017-03-02"]
[null,null,null,null,null,null,null,null,null,null,null,null,null,null,null,"2017-03-01"]
[null,null,null,null,null,null,null,null,null,null,null,null,null,null,null,"2017-02-28"]
[null,null,null,null,null,null,null,null,null,null,null,null,null,null,null,"2017-02-27"]
[null,null,null,null,null,null,null,null,null,null,null,null,null,null,null,"2017-02-24"]
[null,null,null,null,null,null,null,null,null,null,null,null,null,null,null,"2017-02-23"]
[null,null,null,null,null,null,null,null,null,null,null,null,null,null,null,"2017-02-22"]
[null,null,null,null,null,null,null,null,null,null,null,null,null,null,null,"2017-02-21"]
[null,null,null,null,null,null,null,null,null,null,null,null,null,null,null,"2017-02-20"]
[null,null,null,null,null,null,null,null,null,null,null,null,null,null,null,"2017-02-17"]
[null,null,null,null,null,null,null,null,null,null,null,null,null,null,null,"2017-02-16"]
[null,null,null,null,null,null,null,null,null,null,null,null,null,null,null,"2017-02-15"]
[null,null,null,null,null,null,null,null,null,null,null,null,null,null,null,"2017-02-14"]
[null,null,null,null,null,null,null,null,null,null,null,null,null,null,null,"2017-02-13"]
[null,null,null,null,null,null,null,null,null,null,null,null,null,null,null,"2017-02-10"]
[null,null,null,null,null,null,null,null,null,null,null,null,null,null,null,"2017-02-09"]
[null,null,null,null,null,null,null,null,null,null,null,null,null,null,null,"2017-02-08"]
[null,null,null,null,null,null,null,null,null,null,null,null,null,null,null,"2017-02-07"]
[null,null,null,null,null,null,null,null,null,null,null,null,null,null,null,"2017-02-06"]
[null,null,null,null,null,null,null,null,null,null,null,null,null,null,null,"2017-02-03"]
[null,null,null,null,null,null,null,null,null,null,null,null,null,null,null,"2017-02-02"]
[null,null,null,null,null,null,null,null,null,null,null,null,null,null,null,"2017-02-01"]
[null,null,null,null,null,null,null,null,null,null,null,null,null,null,null,"2017-01-31"]
[null,null,null,null,null,null,null,null,null,null,null,null,null,null,null,"2017-01-30"]
[null,null,null,null,null,null,null,null,null,null,null,null,null,null,null,"2017-01-27"]
[null,null,null,null,null,null,null,null,null,null,null,null,null,null,null,"2017-01-26"]
[null,null,null,null,null,null,null,null,null,null,null,null,null,null,null,"2017-01-25"]
[null,null,null,null,null,null,null,null,null,null,null,null,null,null,null,"2017-01-24"]
[null,null,null,null,null,null,null,null,null,null,null,null,null,null,null,"2017-01-23"]
[null,null,null,null,null,null,null,null,null,null,null,null,null,null,null,"2017-01-20"]
[null,null,null,null,null,null,null,null,null,null,null,null,null,null,null,"2017-01-19"]
[null,null,null,null,null,null,null,null,null,null,null,null,null,null,null,"2017-01-18"]
[null,null,null,null,null,null,null,null,null,null,null,null,null,null,null,"2017-01-17"]
[null,null,null,null,null,null,null,null,null,null,null,null,null,null,null,"2017-01-16"]
[null,null,null,null,null,null,null,null,null,null,null,null,null,null,null,"2017-01-13"]
[null,null,null,null,null,null,null,null,null,null,null,null,null,null,null,"2017-01-12"]
[null,null,null,null,null,null,null,null,null,null,null,null,null,null,null,"2017-01-11"]
[null,null,null,null,null,null,null,null,null,null,null,null,null,null,null,"2017-01-10"]
[null,null,null,null,null,null,null,null,null,null,null,null,null,null,null,"2017-01-06"]
[null,null,null,null,null,null,null,null,null,null,null,null,null,null,null,"2017-01-05"]

{"sheet":"Products","index":3,"n_rows":25,"n_cols":9,"rows_kept":25,"cut":false,"hidden":false,"merged":[]}
["7203 Toyota"]
[null,"2016-03-31","2016-03-31","2016-03-31","2015-03-31","2015-03-31","2015-03-31"]
["營業項目","營業毛利構成％","營業收入構成％","營業收入","營業毛利構成％","營業收入構成％","營業收入","變動"]
["M3260008  Automobile Machine Department",null,null,null,null,null,null,{"$f":"IF(A4=\"\",\"\",ROUND(C4-F4,2))","v":0}]
["M65M0002  Finance B.",null,null,null,null,null,null,{"$f":"IF(A5=\"\",\"\",ROUND(C5-F5,2))","v":0}]
["M7620033  Others",null,null,null,null,null,null,0]
[null,null,null,null,null,null,null,""]
[null,null,null,null,null,null,null,""]
[null,null,null,null,null,null,null,"",{"$f":"IF(OR(A9=\"\",B9<=0),\"\",B9)","v":""}]
[null,null,null,null,null,null,null,{"$f":"IFERROR(IF(A10=\"\",\"\",ROUND(C10-F10,2)),\"\")","v":""},""]
[null,null,null,null,null,null,null,{"$f":"IFERROR(IF(A20=\"\",\"\",ROUND(C20-F11,2)),\"\")","v":""},{"$f":"IF(OR(A20=\"\",B20<=0),\"\",B20)","v":""}]
[]
[]
[]
[]
[]
[]
[]
[null,null,null,null,null,{"$f":"IF(A19=\"\",\"\",ROUND(B19-D19,2))","v":""},null,"",""]
[null,"2017-03-31","2017-03-31","2017-03-31",null,null,null,{"$f":"IFERROR(IF(#REF!=\"\",\"\",ROUND(#REF!-F20,2)),\"\")","v":""}]
["營業項目","幣別","營業收入","營業收入構成％",null,null,null,{"$f":"IFERROR(IF(#REF!=\"\",\"\",ROUND(#REF!-F21,2)),\"\")","v":""}]
["S0030001  Americas","JPY",10054.431,36.43,null,null,null,{"$f":"IFERROR(IF(#REF!=\"\",\"\",ROUND(#REF!-F22,2)),\"\")","v":""}]
["S0050001  Asia","JPY",4414.2359999999999,16]
["S0060001  Europe","JPY",2341.364,8.48]
["S0470001  Others Area","JPY",3923.6210000000001,14.22]

{"sheet":"Dividend","index":4,"n_rows":8,"n_cols":6,"rows_kept":8,"cut":false,"hidden":false,"merged":[]}
["7203 Toyota"]
["除息日","股息總額(百萬)","發放日","發放年度","幣別單位","期末總發行股數"]
["2017-03-29"]
["2016-09-28"]
["2016-03-29"]
["2015-09-28"]
["2015-03-27"]
["2014-09-26"]

{"sheet":"ROI(Acc)","index":5,"n_rows":250,"n_cols":9,"rows_kept":250,"cut":false,"hidden":false,"merged":[]}
["7203 Toyota",null,"NIK225 Nikkei 225",null,null,{"$f":"RIGHT(A1,LEN(A1)-SEARCH(\" \",A1,1))","v":"Toyota"},{"$f":"RIGHT(C1,LEN(C1)-SEARCH(\" \",C1,1))","v":"Nikkei 225"},{"$f":"RIGHT(A1,LEN(A1)-SEARCH(\" \",A1,1))","v":"Toyota"},{"$f":"RIGHT(C1,LEN(C1)-SEARCH(\" \",C1,1))","v":"Nikkei 225"}]
["年月日","日報酬率 %","年月日","日報酬率 %",null,"計算過程","計算過程","累積報酬率","累積報酬率"]
["2016-07-05",null,"2016-07-05",null,null,{"$f":"1+B3/100","v":1},{"$f":"1+D3/100","v":1},0,0]
["2016-07-06",null,"2016-07-06",null,null,{"$f":"1+B4/100","v":1},{"$f":"1+D4/100","v":1},{"$f":"PRODUCT($F$4:F4)-1","v":0},{"$f":"PRODUCT($G$4:G4)-1","v":0}]
["2016-07-07",null,"2016-07-07",null,null,1,1,{"$f":"PRODUCT($F$4:F5)-1","v":0},{"$f":"PRODUCT($G$4:G5)-1","v":0}]
["2016-07-08",null,"2016-07-08",null,null,1,1,{"$f":"PRODUCT($F$4:F6)-1","v":0},{"$f":"PRODUCT($G$4:G6)-1","v":0}]
["2016-07-11",null,"2016-07-11",null,null,1,1,{"$f":"PRODUCT($F$4:F7)-1","v":0},{"$f":"PRODUCT($G$4:G7)-1","v":0}]
["2016-07-12",null,"2016-07-12",null,null,1,1,{"$f":"PRODUCT($F$4:F8)-1","v":0},{"$f":"PRODUCT($G$4:G8)-1","v":0}]
["2016-07-13",null,"2016-07-13",null,null,1,1,{"$f":"PRODUCT($F$4:F9)-1","v":0},{"$f":"PRODUCT($G$4:G9)-1","v":0}]
["2016-07-14",null,"2016-07-14",null,null,1,1,{"$f":"PRODUCT($F$4:F10)-1","v":0},{"$f":"PRODUCT($G$4:G10)-1","v":0}]
["2016-07-15",null,"2016-07-15",null,null,1,1,{"$f":"PRODUCT($F$4:F11)-1","v":0},{"$f":"PRODUCT($G$4:G11)-1","v":0}]
["2016-07-19",null,"2016-07-19",null,null,1,1,{"$f":"PRODUCT($F$4:F12)-1","v":0},{"$f":"PRODUCT($G$4:G12)-1","v":0}]
["2016-07-20",null,"2016-07-20",null,null,1,1,{"$f":"PRODUCT($F$4:F13)-1","v":0},{"$f":"PRODUCT($G$4:G13)-1","v":0}]
["2016-07-21",null,"2016-07-21",null,null,1,1,{"$f":"PRODUCT($F$4:F14)-1","v":0},{"$f":"PRODUCT($G$4:G14)-1","v":0}]
["2016-07-22",null,"2016-07-22",null,null,1,1,{"$f":"PRODUCT($F$4:F15)-1","v":0},{"$f":"PRODUCT($G$4:G15)-1","v":0}]
["2016-07-25",null,"2016-07-25",null,null,1,1,{"$f":"PRODUCT($F$4:F16)-1","v":0},{"$f":"PRODUCT($G$4:G16)-1","v":0}]
["2016-07-26",null,"2016-07-26",null,null,1,1,{"$f":"PRODUCT($F$4:F17)-1","v":0},{"$f":"PRODUCT($G$4:G17)-1","v":0}]
["2016-07-27",null,"2016-07-27",null,null,1,1,{"$f":"PRODUCT($F$4:F18)-1","v":0},{"$f":"PRODUCT($G$4:G18)-1","v":0}]
["2016-07-28",null,"2016-07-28",null,null,1,1,{"$f":"PRODUCT($F$4:F19)-1","v":0},{"$f":"PRODUCT($G$4:G19)-1","v":0}]
["2016-07-29",null,"2016-07-29",null,null,1,1,{"$f":"PRODUCT($F$4:F20)-1","v":0},{"$f":"PRODUCT($G$4:G20)-1","v":0}]
["2016-08-01",null,"2016-08-01",null,null,1,1,{"$f":"PRODUCT($F$4:F21)-1","v":0},{"$f":"PRODUCT($G$4:G21)-1","v":0}]
["2016-08-02",null,"2016-08-02",null,null,1,1,{"$f":"PRODUCT($F$4:F22)-1","v":0},{"$f":"PRODUCT($G$4:G22)-1","v":0}]
["2016-08-03",null,"2016-08-03",null,null,1,1,{"$f":"PRODUCT($F$4:F23)-1","v":0},{"$f":"PRODUCT($G$4:G23)-1","v":0}]
["2016-08-04",null,"2016-08-04",null,null,1,1,{"$f":"PRODUCT($F$4:F24)-1","v":0},{"$f":"PRODUCT($G$4:G24)-1","v":0}]
["2016-08-05",null,"2016-08-05",null,null,1,1,{"$f":"PRODUCT($F$4:F25)-1","v":0},{"$f":"PRODUCT($G$4:G25)-1","v":0}]
["2016-08-08",null,"2016-08-08",null,null,1,1,{"$f":"PRODUCT($F$4:F26)-1","v":0},{"$f":"PRODUCT($G$4:G26)-1","v":0}]
["2016-08-09",null,"2016-08-09",null,null,1,1,{"$f":"PRODUCT($F$4:F27)-1","v":0},{"$f":"PRODUCT($G$4:G27)-1","v":0}]
["2016-08-10",null,"2016-08-10",null,null,1,1,{"$f":"PRODUCT($F$4:F28)-1","v":0},{"$f":"PRODUCT($G$4:G28)-1","v":0}]
["2016-08-12",null,"2016-08-12",null,null,1,1,{"$f":"PRODUCT($F$4:F29)-1","v":0},{"$f":"PRODUCT($G$4:G29)-1","v":0}]
["2016-08-15",null,"2016-08-15",null,null,1,1,{"$f":"PRODUCT($F$4:F30)-1","v":0},{"$f":"PRODUCT($G$4:G30)-1","v":0}]
["2016-08-16",null,"2016-08-16",null,null,1,1,{"$f":"PRODUCT($F$4:F31)-1","v":0},{"$f":"PRODUCT($G$4:G31)-1","v":0}]
["2016-08-17",null,"2016-08-17",null,null,1,1,{"$f":"PRODUCT($F$4:F32)-1","v":0},{"$f":"PRODUCT($G$4:G32)-1","v":0}]
["2016-08-18",null,"2016-08-18",null,null,1,1,{"$f":"PRODUCT($F$4:F33)-1","v":0},{"$f":"PRODUCT($G$4:G33)-1","v":0}]
["2016-08-19",null,"2016-08-19",null,null,1,1,{"$f":"PRODUCT($F$4:F34)-1","v":0},{"$f":"PRODUCT($G$4:G34)-1","v":0}]
["2016-08-22",null,"2016-08-22",null,null,1,1,{"$f":"PRODUCT($F$4:F35)-1","v":0},{"$f":"PRODUCT($G$4:G35)-1","v":0}]
["2016-08-23",null,"2016-08-23",null,null,1,1,{"$f":"PRODUCT($F$4:F36)-1","v":0},{"$f":"PRODUCT($G$4:G36)-1","v":0}]
["2016-08-24",null,"2016-08-24",null,null,1,1,{"$f":"PRODUCT($F$4:F37)-1","v":0},{"$f":"PRODUCT($G$4:G37)-1","v":0}]
["2016-08-25",null,"2016-08-25",null,null,1,1,{"$f":"PRODUCT($F$4:F38)-1","v":0},{"$f":"PRODUCT($G$4:G38)-1","v":0}]
["2016-08-26",null,"2016-08-26",null,null,1,1,{"$f":"PRODUCT($F$4:F39)-1","v":0},{"$f":"PRODUCT($G$4:G39)-1","v":0}]
["2016-08-29",null,"2016-08-29",null,null,1,1,{"$f":"PRODUCT($F$4:F40)-1","v":0},{"$f":"PRODUCT($G$4:G40)-1","v":0}]
["2016-08-30",null,"2016-08-30",null,null,1,1,{"$f":"PRODUCT($F$4:F41)-1","v":0},{"$f":"PRODUCT($G$4:G41)-1","v":0}]
["2016-08-31",null,"2016-08-31",null,null,1,1,{"$f":"PRODUCT($F$4:F42)-1","v":0},{"$f":"PRODUCT($G$4:G42)-1","v":0}]
["2016-09-01",null,"2016-09-01",null,null,1,1,{"$f":"PRODUCT($F$4:F43)-1","v":0},{"$f":"PRODUCT($G$4:G43)-1","v":0}]
["2016-09-02",null,"2016-09-02",null,null,1,1,{"$f":"PRODUCT($F$4:F44)-1","v":0},{"$f":"PRODUCT($G$4:G44)-1","v":0}]
["2016-09-05",null,"2016-09-05",null,null,1,1,{"$f":"PRODUCT($F$4:F45)-1","v":0},{"$f":"PRODUCT($G$4:G45)-1","v":0}]
["2016-09-06",null,"2016-09-06",null,null,1,1,{"$f":"PRODUCT($F$4:F46)-1","v":0},{"$f":"PRODUCT($G$4:G46)-1","v":0}]
["2016-09-07",null,"2016-09-07",null,null,1,1,{"$f":"PRODUCT($F$4:F47)-1","v":0},{"$f":"PRODUCT($G$4:G47)-1","v":0}]
["2016-09-08",null,"2016-09-08",null,null,1,1,{"$f":"PRODUCT($F$4:F48)-1","v":0},{"$f":"PRODUCT($G$4:G48)-1","v":0}]
["2016-09-09",null,"2016-09-09",null,null,1,1,{"$f":"PRODUCT($F$4:F49)-1","v":0},{"$f":"PRODUCT($G$4:G49)-1","v":0}]
["2016-09-12",null,"2016-09-12",null,null,1,1,{"$f":"PRODUCT($F$4:F50)-1","v":0},{"$f":"PRODUCT($G$4:G50)-1","v":0}]
["2016-09-13",null,"2016-09-13",null,null,1,1,{"$f":"PRODUCT($F$4:F51)-1","v":0},{"$f":"PRODUCT($G$4:G51)-1","v":0}]
["2016-09-14",null,"2016-09-14",null,null,1,1,{"$f":"PRODUCT($F$4:F52)-1","v":0},{"$f":"PRODUCT($G$4:G52)-1","v":0}]
["2016-09-15",null,"2016-09-15",null,null,1,1,{"$f":"PRODUCT($F$4:F53)-1","v":0},{"$f":"PRODUCT($G$4:G53)-1","v":0}]
["2016-09-16",null,"2016-09-16",null,null,1,1,{"$f":"PRODUCT($F$4:F54)-1","v":0},{"$f":"PRODUCT($G$4:G54)-1","v":0}]
["2016-09-20",null,"2016-09-20",null,null,1,1,{"$f":"PRODUCT($F$4:F55)-1","v":0},{"$f":"PRODUCT($G$4:G55)-1","v":0}]
["2016-09-21",null,"2016-09-21",null,null,1,1,{"$f":"PRODUCT($F$4:F56)-1","v":0},{"$f":"PRODUCT($G$4:G56)-1","v":0}]
["2016-09-23",null,"2016-09-23",null,null,1,1,{"$f":"PRODUCT($F$4:F57)-1","v":0},{"$f":"PRODUCT($G$4:G57)-1","v":0}]
["2016-09-26",null,"2016-09-26",null,null,1,1,{"$f":"PRODUCT($F$4:F58)-1","v":0},{"$f":"PRODUCT($G$4:G58)-1","v":0}]
["2016-09-27",null,"2016-09-27",null,null,1,1,{"$f":"PRODUCT($F$4:F59)-1","v":0},{"$f":"PRODUCT($G$4:G59)-1","v":0}]
["2016-09-28",null,"2016-09-28",null,null,1,1,{"$f":"PRODUCT($F$4:F60)-1","v":0},{"$f":"PRODUCT($G$4:G60)-1","v":0}]
["2016-09-29",null,"2016-09-29",null,null,1,1,{"$f":"PRODUCT($F$4:F61)-1","v":0},{"$f":"PRODUCT($G$4:G61)-1","v":0}]
["2016-09-30",null,"2016-09-30",null,null,1,1,{"$f":"PRODUCT($F$4:F62)-1","v":0},{"$f":"PRODUCT($G$4:G62)-1","v":0}]
["2016-10-03",null,"2016-10-03",null,null,1,1,{"$f":"PRODUCT($F$4:F63)-1","v":0},{"$f":"PRODUCT($G$4:G63)-1","v":0}]
["2016-10-04",null,"2016-10-04",null,null,1,1,{"$f":"PRODUCT($F$4:F64)-1","v":0},{"$f":"PRODUCT($G$4:G64)-1","v":0}]
["2016-10-05",null,"2016-10-05",null,null,1,1,{"$f":"PRODUCT($F$4:F65)-1","v":0},{"$f":"PRODUCT($G$4:G65)-1","v":0}]
["2016-10-06",null,"2016-10-06",null,null,1,1,{"$f":"PRODUCT($F$4:F66)-1","v":0},{"$f":"PRODUCT($G$4:G66)-1","v":0}]
["2016-10-07",null,"2016-10-07",null,null,1,1,{"$f":"PRODUCT($F$4:F67)-1","v":0},{"$f":"PRODUCT($G$4:G67)-1","v":0}]
["2016-10-11",null,"2016-10-11",null,null,{"$f":"1+B68/100","v":1},{"$f":"1+D68/100","v":1},{"$f":"PRODUCT($F$4:F68)-1","v":0},{"$f":"PRODUCT($G$4:G68)-1","v":0}]
["2016-10-12",null,"2016-10-12",null,null,1,1,{"$f":"PRODUCT($F$4:F69)-1","v":0},{"$f":"PRODUCT($G$4:G69)-1","v":0}]
["2016-10-13",null,"2016-10-13",null,null,1,1,{"$f":"PRODUCT($F$4:F70)-1","v":0},{"$f":"PRODUCT($G$4:G70)-1","v":0}]
["2016-10-14",null,"2016-10-14",null,null,1,1,{"$f":"PRODUCT($F$4:F71)-1","v":0},{"$f":"PRODUCT($G$4:G71)-1","v":0}]
["2016-10-17",null,"2016-10-17",null,null,1,1,{"$f":"PRODUCT($F$4:F72)-1","v":0},{"$f":"PRODUCT($G$4:G72)-1","v":0}]
["2016-10-18",null,"2016-10-18",null,null,1,1,{"$f":"PRODUCT($F$4:F73)-1","v":0},{"$f":"PRODUCT($G$4:G73)-1","v":0}]
["2016-10-19",null,"2016-10-19",null,null,1,1,{"$f":"PRODUCT($F$4:F74)-1","v":0},{"$f":"PRODUCT($G$4:G74)-1","v":0}]
["2016-10-20",null,"2016-10-20",null,null,1,1,{"$f":"PRODUCT($F$4:F75)-1","v":0},{"$f":"PRODUCT($G$4:G75)-1","v":0}]
["2016-10-21",null,"2016-10-21",null,null,1,1,{"$f":"PRODUCT($F$4:F76)-1","v":0},{"$f":"PRODUCT($G$4:G76)-1","v":0}]
["2016-10-24",null,"2016-10-24",null,null,1,1,{"$f":"PRODUCT($F$4:F77)-1","v":0},{"$f":"PRODUCT($G$4:G77)-1","v":0}]
["2016-10-25",null,"2016-10-25",null,null,1,1,{"$f":"PRODUCT($F$4:F78)-1","v":0},{"$f":"PRODUCT($G$4:G78)-1","v":0}]
["2016-10-26",null,"2016-10-26",null,null,1,1,{"$f":"PRODUCT($F$4:F79)-1","v":0},{"$f":"PRODUCT($G$4:G79)-1","v":0}]
["2016-10-27",null,"2016-10-27",null,null,1,1,{"$f":"PRODUCT($F$4:F80)-1","v":0},{"$f":"PRODUCT($G$4:G80)-1","v":0}]
["2016-10-28",null,"2016-10-28",null,null,1,1,{"$f":"PRODUCT($F$4:F81)-1","v":0},{"$f":"PRODUCT($G$4:G81)-1","v":0}]
["2016-10-31",null,"2016-10-31",null,null,1,1,{"$f":"PRODUCT($F$4:F82)-1","v":0},{"$f":"PRODUCT($G$4:G82)-1","v":0}]
["2016-11-01",null,"2016-11-01",null,null,1,1,{"$f":"PRODUCT($F$4:F83)-1","v":0},{"$f":"PRODUCT($G$4:G83)-1","v":0}]
["2016-11-02",null,"2016-11-02",null,null,1,1,{"$f":"PRODUCT($F$4:F84)-1","v":0},{"$f":"PRODUCT($G$4:G84)-1","v":0}]
["2016-11-04",null,"2016-11-04",null,null,1,1,{"$f":"PRODUCT($F$4:F85)-1","v":0},{"$f":"PRODUCT($G$4:G85)-1","v":0}]
["2016-11-07",null,"2016-11-07",null,null,1,1,{"$f":"PRODUCT($F$4:F86)-1","v":0},{"$f":"PRODUCT($G$4:G86)-1","v":0}]
["2016-11-08",null,"2016-11-08",null,null,1,1,{"$f":"PRODUCT($F$4:F87)-1","v":0},{"$f":"PRODUCT($G$4:G87)-1","v":0}]
["2016-11-09",null,"2016-11-09",null,null,1,1,{"$f":"PRODUCT($F$4:F88)-1","v":0},{"$f":"PRODUCT($G$4:G88)-1","v":0}]
["2016-11-10",null,"2016-11-10",null,null,1,1,{"$f":"PRODUCT($F$4:F89)-1","v":0},{"$f":"PRODUCT($G$4:G89)-1","v":0}]
["2016-11-11",null,"2016-11-11",null,null,1,1,{"$f":"PRODUCT($F$4:F90)-1","v":0},{"$f":"PRODUCT($G$4:G90)-1","v":0}]
["2016-11-14",null,"2016-11-14",null,null,1,1,{"$f":"PRODUCT($F$4:F91)-1","v":0},{"$f":"PRODUCT($G$4:G91)-1","v":0}]
["2016-11-15",null,"2016-11-15",null,null,1,1,{"$f":"PRODUCT($F$4:F92)-1","v":0},{"$f":"PRODUCT($G$4:G92)-1","v":0}]
["2016-11-16",null,"2016-11-16",null,null,1,1,{"$f":"PRODUCT($F$4:F93)-1","v":0},{"$f":"PRODUCT($G$4:G93)-1","v":0}]
["2016-11-17",null,"2016-11-17",null,null,1,1,{"$f":"PRODUCT($F$4:F94)-1","v":0},{"$f":"PRODUCT($G$4:G94)-1","v":0}]
["2016-11-18",null,"2016-11-18",null,null,1,1,{"$f":"PRODUCT($F$4:F95)-1","v":0},{"$f":"PRODUCT($G$4:G95)-1","v":0}]
["2016-11-21",null,"2016-11-21",null,null,1,1,{"$f":"PRODUCT($F$4:F96)-1","v":0},{"$f":"PRODUCT($G$4:G96)-1","v":0}]
["2016-11-22",null,"2016-11-22",null,null,1,1,{"$f":"PRODUCT($F$4:F97)-1","v":0},{"$f":"PRODUCT($G$4:G97)-1","v":0}]
["2016-11-24",null,"2016-11-24",null,null,1,1,{"$f":"PRODUCT($F$4:F98)-1","v":0},{"$f":"PRODUCT($G$4:G98)-1","v":0}]
["2016-11-25",null,"2016-11-25",null,null,1,1,{"$f":"PRODUCT($F$4:F99)-1","v":0},{"$f":"PRODUCT($G$4:G99)-1","v":0}]
["2016-11-28",null,"2016-11-28",null,null,1,1,{"$f":"PRODUCT($F$4:F100)-1","v":0},{"$f":"PRODUCT($G$4:G100)-1","v":0}]
["2016-11-29",null,"2016-11-29",null,null,1,1,{"$f":"PRODUCT($F$4:F101)-1","v":0},{"$f":"PRODUCT($G$4:G101)-1","v":0}]
["2016-11-30",null,"2016-11-30",null,null,1,1,{"$f":"PRODUCT($F$4:F102)-1","v":0},{"$f":"PRODUCT($G$4:G102)-1","v":0}]
["2016-12-01",null,"2016-12-01",null,null,1,1,{"$f":"PRODUCT($F$4:F103)-1","v":0},{"$f":"PRODUCT($G$4:G103)-1","v":0}]
["2016-12-02",null,"2016-12-02",null,null,1,1,{"$f":"PRODUCT($F$4:F104)-1","v":0},{"$f":"PRODUCT($G$4:G104)-1","v":0}]
["2016-12-05",null,"2016-12-05",null,null,1,1,{"$f":"PRODUCT($F$4:F105)-1","v":0},{"$f":"PRODUCT($G$4:G105)-1","v":0}]
["2016-12-06",null,"2016-12-06",null,null,1,1,{"$f":"PRODUCT($F$4:F106)-1","v":0},{"$f":"PRODUCT($G$4:G106)-1","v":0}]
["2016-12-07",null,"2016-12-07",null,null,1,1,{"$f":"PRODUCT($F$4:F107)-1","v":0},{"$f":"PRODUCT($G$4:G107)-1","v":0}]
["2016-12-08",null,"2016-12-08",null,null,1,1,{"$f":"PRODUCT($F$4:F108)-1","v":0},{"$f":"PRODUCT($G$4:G108)-1","v":0}]
["2016-12-09",null,"2016-12-09",null,null,1,1,{"$f":"PRODUCT($F$4:F109)-1","v":0},{"$f":"PRODUCT($G$4:G109)-1","v":0}]
["2016-12-12",null,"2016-12-12",null,null,1,1,{"$f":"PRODUCT($F$4:F110)-1","v":0},{"$f":"PRODUCT($G$4:G110)-1","v":0}]
["2016-12-13",null,"2016-12-13",null,null,1,1,{"$f":"PRODUCT($F$4:F111)-1","v":0},{"$f":"PRODUCT($G$4:G111)-1","v":0}]
["2016-12-14",null,"2016-12-14",null,null,1,1,{"$f":"PRODUCT($F$4:F112)-1","v":0},{"$f":"PRODUCT($G$4:G112)-1","v":0}]
["2016-12-15",null,"2016-12-15",null,null,1,1,{"$f":"PRODUCT($F$4:F113)-1","v":0},{"$f":"PRODUCT($G$4:G113)-1","v":0}]
["2016-12-16",null,"2016-12-16",null,null,1,1,{"$f":"PRODUCT($F$4:F114)-1","v":0},{"$f":"PRODUCT($G$4:G114)-1","v":0}]
["2016-12-19",null,"2016-12-19",null,null,1,1,{"$f":"PRODUCT($F$4:F115)-1","v":0},{"$f":"PRODUCT($G$4:G115)-1","v":0}]
["2016-12-20",null,"2016-12-20",null,null,1,1,{"$f":"PRODUCT($F$4:F116)-1","v":0},{"$f":"PRODUCT($G$4:G116)-1","v":0}]
["2016-12-21",null,"2016-12-21",null,null,1,1,{"$f":"PRODUCT($F$4:F117)-1","v":0},{"$f":"PRODUCT($G$4:G117)-1","v":0}]
["2016-12-22",null,"2016-12-22",null,null,1,1,{"$f":"PRODUCT($F$4:F118)-1","v":0},{"$f":"PRODUCT($G$4:G118)-1","v":0}]
["2016-12-26",null,"2016-12-26",null,null,1,1,{"$f":"PRODUCT($F$4:F119)-1","v":0},{"$f":"PRODUCT($G$4:G119)-1","v":0}]
["2016-12-27",null,"2016-12-27",null,null,1,1,{"$f":"PRODUCT($F$4:F120)-1","v":0},{"$f":"PRODUCT($G$4:G120)-1","v":0}]
["2016-12-28",null,"2016-12-28",null,null,1,1,{"$f":"PRODUCT($F$4:F121)-1","v":0},{"$f":"PRODUCT($G$4:G121)-1","v":0}]
["2016-12-29",null,"2016-12-29",null,null,1,1,{"$f":"PRODUCT($F$4:F122)-1","v":0},{"$f":"PRODUCT($G$4:G122)-1","v":0}]
["2016-12-30",null,"2016-12-30",null,null,1,1,{"$f":"PRODUCT($F$4:F123)-1","v":0},{"$f":"PRODUCT($G$4:G123)-1","v":0}]
["2017-01-04",null,"2017-01-04",null,null,1,1,{"$f":"PRODUCT($F$4:F124)-1","v":0},{"$f":"PRODUCT($G$4:G124)-1","v":0}]
["2017-01-05",null,"2017-01-05",null,null,1,1,{"$f":"PRODUCT($F$4:F125)-1","v":0},{"$f":"PRODUCT($G$4:G125)-1","v":0}]
["2017-01-06",null,"2017-01-06",null,null,1,1,{"$f":"PRODUCT($F$4:F126)-1","v":0},{"$f":"PRODUCT($G$4:G126)-1","v":0}]
["2017-01-10",null,"2017-01-10",null,null,1,1,{"$f":"PRODUCT($F$4:F127)-1","v":0},{"$f":"PRODUCT($G$4:G127)-1","v":0}]
["2017-01-11",null,"2017-01-11",null,null,1,1,{"$f":"PRODUCT($F$4:F128)-1","v":0},{"$f":"PRODUCT($G$4:G128)-1","v":0}]
["2017-01-12",null,"2017-01-12",null,null,1,1,{"$f":"PRODUCT($F$4:F129)-1","v":0},{"$f":"PRODUCT($G$4:G129)-1","v":0}]
["2017-01-13",null,"2017-01-13",null,null,1,1,{"$f":"PRODUCT($F$4:F130)-1","v":0},{"$f":"PRODUCT($G$4:G130)-1","v":0}]
["2017-01-16",null,"2017-01-16",null,null,1,1,{"$f":"PRODUCT($F$4:F131)-1","v":0},{"$f":"PRODUCT($G$4:G131)-1","v":0}]
["2017-01-17",null,"2017-01-17",null,null,{"$f":"1+B132/100","v":1},{"$f":"1+D132/100","v":1},{"$f":"PRODUCT($F$4:F132)-1","v":0},{"$f":"PRODUCT($G$4:G132)-1","v":0}]
["2017-01-18",null,"2017-01-18",null,null,1,1,{"$f":"PRODUCT($F$4:F133)-1","v":0},{"$f":"PRODUCT($G$4:G133)-1","v":0}]
["2017-01-19",null,"2017-01-19",null,null,1,1,{"$f":"PRODUCT($F$4:F134)-1","v":0},{"$f":"PRODUCT($G$4:G134)-1","v":0}]
["2017-01-20",null,"2017-01-20",null,null,1,1,{"$f":"PRODUCT($F$4:F135)-1","v":0},{"$f":"PRODUCT($G$4:G135)-1","v":0}]
["2017-01-23",null,"2017-01-23",null,null,1,1,{"$f":"PRODUCT($F$4:F136)-1","v":0},{"$f":"PRODUCT($G$4:G136)-1","v":0}]
["2017-01-24",null,"2017-01-24",null,null,1,1,{"$f":"PRODUCT($F$4:F137)-1","v":0},{"$f":"PRODUCT($G$4:G137)-1","v":0}]
["2017-01-25",null,"2017-01-25",null,null,1,1,{"$f":"PRODUCT($F$4:F138)-1","v":0},{"$f":"PRODUCT($G$4:G138)-1","v":0}]
["2017-01-26",null,"2017-01-26",null,null,1,1,{"$f":"PRODUCT($F$4:F139)-1","v":0},{"$f":"PRODUCT($G$4:G139)-1","v":0}]
["2017-01-27",null,"2017-01-27",null,null,1,1,{"$f":"PRODUCT($F$4:F140)-1","v":0},{"$f":"PRODUCT($G$4:G140)-1","v":0}]
["2017-01-30",null,"2017-01-30",null,null,1,1,{"$f":"PRODUCT($F$4:F141)-1","v":0},{"$f":"PRODUCT($G$4:G141)-1","v":0}]
["2017-01-31",null,"2017-01-31",null,null,1,1,{"$f":"PRODUCT($F$4:F142)-1","v":0},{"$f":"PRODUCT($G$4:G142)-1","v":0}]
["2017-02-01",null,"2017-02-01",null,null,1,1,{"$f":"PRODUCT($F$4:F143)-1","v":0},{"$f":"PRODUCT($G$4:G143)-1","v":0}]
["2017-02-02",null,"2017-02-02",null,null,1,1,{"$f":"PRODUCT($F$4:F144)-1","v":0},{"$f":"PRODUCT($G$4:G144)-1","v":0}]
["2017-02-03",null,"2017-02-03",null,null,1,1,{"$f":"PRODUCT($F$4:F145)-1","v":0},{"$f":"PRODUCT($G$4:G145)-1","v":0}]
["2017-02-06",null,"2017-02-06",null,null,1,1,{"$f":"PRODUCT($F$4:F146)-1","v":0},{"$f":"PRODUCT($G$4:G146)-1","v":0}]
["2017-02-07",null,"2017-02-07",null,null,1,1,{"$f":"PRODUCT($F$4:F147)-1","v":0},{"$f":"PRODUCT($G$4:G147)-1","v":0}]
["2017-02-08",null,"2017-02-08",null,null,1,1,{"$f":"PRODUCT($F$4:F148)-1","v":0},{"$f":"PRODUCT($G$4:G148)-1","v":0}]
["2017-02-09",null,"2017-02-09",null,null,1,1,{"$f":"PRODUCT($F$4:F149)-1","v":0},{"$f":"PRODUCT($G$4:G149)-1","v":0}]
["2017-02-10",null,"2017-02-10",null,null,1,1,{"$f":"PRODUCT($F$4:F150)-1","v":0},{"$f":"PRODUCT($G$4:G150)-1","v":0}]
["2017-02-13",null,"2017-02-13",null,null,1,1,{"$f":"PRODUCT($F$4:F151)-1","v":0},{"$f":"PRODUCT($G$4:G151)-1","v":0}]
["2017-02-14",null,"2017-02-14",null,null,1,1,{"$f":"PRODUCT($F$4:F152)-1","v":0},{"$f":"PRODUCT($G$4:G152)-1","v":0}]
["2017-02-15",null,"2017-02-15",null,null,1,1,{"$f":"PRODUCT($F$4:F153)-1","v":0},{"$f":"PRODUCT($G$4:G153)-1","v":0}]
["2017-02-16",null,"2017-02-16",null,null,1,1,{"$f":"PRODUCT($F$4:F154)-1","v":0},{"$f":"PRODUCT($G$4:G154)-1","v":0}]
["2017-02-17",null,"2017-02-17",null,null,1,1,{"$f":"PRODUCT($F$4:F155)-1","v":0},{"$f":"PRODUCT($G$4:G155)-1","v":0}]
["2017-02-20",null,"2017-02-20",null,null,1,1,{"$f":"PRODUCT($F$4:F156)-1","v":0},{"$f":"PRODUCT($G$4:G156)-1","v":0}]
["2017-02-21",null,"2017-02-21",null,null,1,1,{"$f":"PRODUCT($F$4:F157)-1","v":0},{"$f":"PRODUCT($G$4:G157)-1","v":0}]
["2017-02-22",null,"2017-02-22",null,null,1,1,{"$f":"PRODUCT($F$4:F158)-1","v":0},{"$f":"PRODUCT($G$4:G158)-1","v":0}]
["2017-02-23",null,"2017-02-23",null,null,1,1,{"$f":"PRODUCT($F$4:F159)-1","v":0},{"$f":"PRODUCT($G$4:G159)-1","v":0}]
["2017-02-24",null,"2017-02-24",null,null,1,1,{"$f":"PRODUCT($F$4:F160)-1","v":0},{"$f":"PRODUCT($G$4:G160)-1","v":0}]
["2017-02-27",null,"2017-02-27",null,null,1,1,{"$f":"PRODUCT($F$4:F161)-1","v":0},{"$f":"PRODUCT($G$4:G161)-1","v":0}]
["2017-02-28",null,"2017-02-28",null,null,1,1,{"$f":"PRODUCT($F$4:F162)-1","v":0},{"$f":"PRODUCT($G$4:G162)-1","v":0}]
["2017-03-01",null,"2017-03-01",null,null,1,1,{"$f":"PRODUCT($F$4:F163)-1","v":0},{"$f":"PRODUCT($G$4:G163)-1","v":0}]
["2017-03-02",null,"2017-03-02",null,null,1,1,{"$f":"PRODUCT($F$4:F164)-1","v":0},{"$f":"PRODUCT($G$4:G164)-1","v":0}]
["2017-03-03",null,"2017-03-03",null,null,1,1,{"$f":"PRODUCT($F$4:F165)-1","v":0},{"$f":"PRODUCT($G$4:G165)-1","v":0}]
["2017-03-06",null,"2017-03-06",null,null,1,1,{"$f":"PRODUCT($F$4:F166)-1","v":0},{"$f":"PRODUCT($G$4:G166)-1","v":0}]
["2017-03-07",null,"2017-03-07",null,null,1,1,{"$f":"PRODUCT($F$4:F167)-1","v":0},{"$f":"PRODUCT($G$4:G167)-1","v":0}]
["2017-03-08",null,"2017-03-08",null,null,1,1,{"$f":"PRODUCT($F$4:F168)-1","v":0},{"$f":"PRODUCT($G$4:G168)-1","v":0}]
["2017-03-09",null,"2017-03-09",null,null,1,1,{"$f":"PRODUCT($F$4:F169)-1","v":0},{"$f":"PRODUCT($G$4:G169)-1","v":0}]
["2017-03-10",null,"2017-03-10",null,null,1,1,{"$f":"PRODUCT($F$4:F170)-1","v":0},{"$f":"PRODUCT($G$4:G170)-1","v":0}]
["2017-03-13",null,"2017-03-13",null,null,1,1,{"$f":"PRODUCT($F$4:F171)-1","v":0},{"$f":"PRODUCT($G$4:G171)-1","v":0}]
["2017-03-14",null,"2017-03-14",null,null,1,1,{"$f":"PRODUCT($F$4:F172)-1","v":0},{"$f":"PRODUCT($G$4:G172)-1","v":0}]
["2017-03-15",null,"2017-03-15",null,null,1,1,{"$f":"PRODUCT($F$4:F173)-1","v":0},{"$f":"PRODUCT($G$4:G173)-1","v":0}]
["2017-03-16",null,"2017-03-16",null,null,1,1,{"$f":"PRODUCT($F$4:F174)-1","v":0},{"$f":"PRODUCT($G$4:G174)-1","v":0}]
["2017-03-17",null,"2017-03-17",null,null,1,1,{"$f":"PRODUCT($F$4:F175)-1","v":0},{"$f":"PRODUCT($G$4:G175)-1","v":0}]
["2017-03-21",null,"2017-03-21",null,null,1,1,{"$f":"PRODUCT($F$4:F176)-1","v":0},{"$f":"PRODUCT($G$4:G176)-1","v":0}]
["2017-03-22",null,"2017-03-22",null,null,1,1,{"$f":"PRODUCT($F$4:F177)-1","v":0},{"$f":"PRODUCT($G$4:G177)-1","v":0}]
["2017-03-23",null,"2017-03-23",null,null,1,1,{"$f":"PRODUCT($F$4:F178)-1","v":0},{"$f":"PRODUCT($G$4:G178)-1","v":0}]
["2017-03-24",null,"2017-03-24",null,null,1,1,{"$f":"PRODUCT($F$4:F179)-1","v":0},{"$f":"PRODUCT($G$4:G179)-1","v":0}]
["2017-03-27",null,"2017-03-27",null,null,1,1,{"$f":"PRODUCT($F$4:F180)-1","v":0},{"$f":"PRODUCT($G$4:G180)-1","v":0}]
["2017-03-28",null,"2017-03-28",null,null,1,1,{"$f":"PRODUCT($F$4:F181)-1","v":0},{"$f":"PRODUCT($G$4:G181)-1","v":0}]
["2017-03-29",null,"2017-03-29",null,null,1,1,{"$f":"PRODUCT($F$4:F182)-1","v":0},{"$f":"PRODUCT($G$4:G182)-1","v":0}]
["2017-03-30",null,"2017-03-30",null,null,1,1,{"$f":"PRODUCT($F$4:F183)-1","v":0},{"$f":"PRODUCT($G$4:G183)-1","v":0}]
["2017-03-31",null,"2017-03-31",null,null,1,1,{"$f":"PRODUCT($F$4:F184)-1","v":0},{"$f":"PRODUCT($G$4:G184)-1","v":0}]
["2017-04-03",null,"2017-04-03",null,null,1,1,{"$f":"PRODUCT($F$4:F185)-1","v":0},{"$f":"PRODUCT($G$4:G185)-1","v":0}]
["2017-04-04",null,"2017-04-04",null,null,1,1,{"$f":"PRODUCT($F$4:F186)-1","v":0},{"$f":"PRODUCT($G$4:G186)-1","v":0}]
["2017-04-05",null,"2017-04-05",null,null,1,1,{"$f":"PRODUCT($F$4:F187)-1","v":0},{"$f":"PRODUCT($G$4:G187)-1","v":0}]
["2017-04-06",null,"2017-04-06",null,null,1,1,{"$f":"PRODUCT($F$4:F188)-1","v":0},{"$f":"PRODUCT($G$4:G188)-1","v":0}]
["2017-04-07",null,"2017-04-07",null,null,1,1,{"$f":"PRODUCT($F$4:F189)-1","v":0},{"$f":"PRODUCT($G$4:G189)-1","v":0}]
["2017-04-10",null,"2017-04-10",null,null,1,1,{"$f":"PRODUCT($F$4:F190)-1","v":0},{"$f":"PRODUCT($G$4:G190)-1","v":0}]
["2017-04-11",null,"2017-04-11",null,null,1,1,{"$f":"PRODUCT($F$4:F191)-1","v":0},{"$f":"PRODUCT($G$4:G191)-1","v":0}]
["2017-04-12",null,"2017-04-12",null,null,1,1,{"$f":"PRODUCT($F$4:F192)-1","v":0},{"$f":"PRODUCT($G$4:G192)-1","v":0}]
["2017-04-13",null,"2017-04-13",null,null,1,1,{"$f":"PRODUCT($F$4:F193)-1","v":0},{"$f":"PRODUCT($G$4:G193)-1","v":0}]
["2017-04-14",null,"2017-04-14",null,null,1,1,{"$f":"PRODUCT($F$4:F194)-1","v":0},{"$f":"PRODUCT($G$4:G194)-1","v":0}]
["2017-04-17",null,"2017-04-17",null,null,1,1,{"$f":"PRODUCT($F$4:F195)-1","v":0},{"$f":"PRODUCT($G$4:G195)-1","v":0}]
["2017-04-18",null,"2017-04-18",null,null,{"$f":"1+B196/100","v":1},{"$f":"1+D196/100","v":1},{"$f":"PRODUCT($F$4:F196)-1","v":0},{"$f":"PRODUCT($G$4:G196)-1","v":0}]
["2017-04-19",null,"2017-04-19",null,null,1,1,{"$f":"PRODUCT($F$4:F197)-1","v":0},{"$f":"PRODUCT($G$4:G197)-1","v":0}]
["2017-04-20",null,"2017-04-20",null,null,1,1,{"$f":"PRODUCT($F$4:F198)-1","v":0},{"$f":"PRODUCT($G$4:G198)-1","v":0}]
["2017-04-21",null,"2017-04-21",null,null,1,1,{"$f":"PRODUCT($F$4:F199)-1","v":0},{"$f":"PRODUCT($G$4:G199)-1","v":0}]
["2017-04-24",null,"2017-04-24",null,null,1,1,{"$f":"PRODUCT($F$4:F200)-1","v":0},{"$f":"PRODUCT($G$4:G200)-1","v":0}]
["2017-04-25",null,"2017-04-25",null,null,1,1,{"$f":"PRODUCT($F$4:F201)-1","v":0},{"$f":"PRODUCT($G$4:G201)-1","v":0}]
["2017-04-26",null,"2017-04-26",null,null,1,1,{"$f":"PRODUCT($F$4:F202)-1","v":0},{"$f":"PRODUCT($G$4:G202)-1","v":0}]
["2017-04-27",null,"2017-04-27",null,null,1,1,{"$f":"PRODUCT($F$4:F203)-1","v":0},{"$f":"PRODUCT($G$4:G203)-1","v":0}]
["2017-04-28",null,"2017-04-28",null,null,1,1,{"$f":"PRODUCT($F$4:F204)-1","v":0},{"$f":"PRODUCT($G$4:G204)-1","v":0}]
["2017-05-01",null,"2017-05-01",null,null,1,1,{"$f":"PRODUCT($F$4:F205)-1","v":0},{"$f":"PRODUCT($G$4:G205)-1","v":0}]
["2017-05-02",null,"2017-05-02",null,null,1,1,{"$f":"PRODUCT($F$4:F206)-1","v":0},{"$f":"PRODUCT($G$4:G206)-1","v":0}]
["2017-05-08",null,"2017-05-08",null,null,1,1,{"$f":"PRODUCT($F$4:F207)-1","v":0},{"$f":"PRODUCT($G$4:G207)-1","v":0}]
["2017-05-09",null,"2017-05-09",null,null,1,1,{"$f":"PRODUCT($F$4:F208)-1","v":0},{"$f":"PRODUCT($G$4:G208)-1","v":0}]
["2017-05-10",null,"2017-05-10",null,null,1,1,{"$f":"PRODUCT($F$4:F209)-1","v":0},{"$f":"PRODUCT($G$4:G209)-1","v":0}]
["2017-05-11",null,"2017-05-11",null,null,1,1,{"$f":"PRODUCT($F$4:F210)-1","v":0},{"$f":"PRODUCT($G$4:G210)-1","v":0}]
["2017-05-12",null,"2017-05-12",null,null,1,1,{"$f":"PRODUCT($F$4:F211)-1","v":0},{"$f":"PRODUCT($G$4:G211)-1","v":0}]
["2017-05-15",null,"2017-05-15",null,null,1,1,{"$f":"PRODUCT($F$4:F212)-1","v":0},{"$f":"PRODUCT($G$4:G212)-1","v":0}]
["2017-05-16",null,"2017-05-16",null,null,1,1,{"$f":"PRODUCT($F$4:F213)-1","v":0},{"$f":"PRODUCT($G$4:G213)-1","v":0}]
["2017-05-17",null,"2017-05-17",null,null,1,1,{"$f":"PRODUCT($F$4:F214)-1","v":0},{"$f":"PRODUCT($G$4:G214)-1","v":0}]
["2017-05-18",null,"2017-05-18",null,null,1,1,{"$f":"PRODUCT($F$4:F215)-1","v":0},{"$f":"PRODUCT($G$4:G215)-1","v":0}]
["2017-05-19",null,"2017-05-19",null,null,1,1,{"$f":"PRODUCT($F$4:F216)-1","v":0},{"$f":"PRODUCT($G$4:G216)-1","v":0}]
["2017-05-22",null,"2017-05-22",null,null,1,1,{"$f":"PRODUCT($F$4:F217)-1","v":0},{"$f":"PRODUCT($G$4:G217)-1","v":0}]
["2017-05-23",null,"2017-05-23",null,null,1,1,{"$f":"PRODUCT($F$4:F218)-1","v":0},{"$f":"PRODUCT($G$4:G218)-1","v":0}]
["2017-05-24",null,"2017-05-24",null,null,1,1,{"$f":"PRODUCT($F$4:F219)-1","v":0},{"$f":"PRODUCT($G$4:G219)-1","v":0}]
["2017-05-25",null,"2017-05-25",null,null,1,1,{"$f":"PRODUCT($F$4:F220)-1","v":0},{"$f":"PRODUCT($G$4:G220)-1","v":0}]
["2017-05-26",null,"2017-05-26",null,null,1,1,{"$f":"PRODUCT($F$4:F221)-1","v":0},{"$f":"PRODUCT($G$4:G221)-1","v":0}]
["2017-05-29",null,"2017-05-29",null,null,1,1,{"$f":"PRODUCT($F$4:F222)-1","v":0},{"$f":"PRODUCT($G$4:G222)-1","v":0}]
["2017-05-30",null,"2017-05-30",null,null,1,1,{"$f":"PRODUCT($F$4:F223)-1","v":0},{"$f":"PRODUCT($G$4:G223)-1","v":0}]
["2017-05-31",null,"2017-05-31",null,null,1,1,{"$f":"PRODUCT($F$4:F224)-1","v":0},{"$f":"PRODUCT($G$4:G224)-1","v":0}]
["2017-06-01",null,"2017-06-01",null,null,1,1,{"$f":"PRODUCT($F$4:F225)-1","v":0},{"$f":"PRODUCT($G$4:G225)-1","v":0}]
["2017-06-02",null,"2017-06-02",null,null,1,1,{"$f":"PRODUCT($F$4:F226)-1","v":0},{"$f":"PRODUCT($G$4:G226)-1","v":0}]
["2017-06-05",null,"2017-06-05",null,null,1,1,{"$f":"PRODUCT($F$4:F227)-1","v":0},{"$f":"PRODUCT($G$4:G227)-1","v":0}]
["2017-06-06",null,"2017-06-06",null,null,1,1,{"$f":"PRODUCT($F$4:F228)-1","v":0},{"$f":"PRODUCT($G$4:G228)-1","v":0}]
["2017-06-07",null,"2017-06-07",null,null,1,1,{"$f":"PRODUCT($F$4:F229)-1","v":0},{"$f":"PRODUCT($G$4:G229)-1","v":0}]
["2017-06-08",null,"2017-06-08",null,null,1,1,{"$f":"PRODUCT($F$4:F230)-1","v":0},{"$f":"PRODUCT($G$4:G230)-1","v":0}]
["2017-06-09",null,"2017-06-09",null,null,1,1,{"$f":"PRODUCT($F$4:F231)-1","v":0},{"$f":"PRODUCT($G$4:G231)-1","v":0}]
["2017-06-12",null,"2017-06-12",null,null,1,1,{"$f":"PRODUCT($F$4:F232)-1","v":0},{"$f":"PRODUCT($G$4:G232)-1","v":0}]
["2017-06-13",null,"2017-06-13",null,null,1,1,{"$f":"PRODUCT($F$4:F233)-1","v":0},{"$f":"PRODUCT($G$4:G233)-1","v":0}]
["2017-06-14",null,"2017-06-14",null,null,1,1,{"$f":"PRODUCT($F$4:F234)-1","v":0},{"$f":"PRODUCT($G$4:G234)-1","v":0}]
["2017-06-16",null,"2017-06-16",null,null,1,1,{"$f":"PRODUCT($F$4:F235)-1","v":0},{"$f":"PRODUCT($G$4:G235)-1","v":0}]
["2017-06-19",null,"2017-06-19",null,null,1,1,{"$f":"PRODUCT($F$4:F236)-1","v":0},{"$f":"PRODUCT($G$4:G236)-1","v":0}]
["2017-06-20",null,"2017-06-20",null,null,1,1,{"$f":"PRODUCT($F$4:F237)-1","v":0},{"$f":"PRODUCT($G$4:G237)-1","v":0}]
["2017-06-21",null,"2017-06-21",null,null,1,1,{"$f":"PRODUCT($F$4:F238)-1","v":0},{"$f":"PRODUCT($G$4:G238)-1","v":0}]
["2017-06-22",null,"2017-06-22",null,null,1,1,{"$f":"PRODUCT($F$4:F239)-1","v":0},{"$f":"PRODUCT($G$4:G239)-1","v":0}]
["2017-06-23",null,"2017-06-23",null,null,1,1,{"$f":"PRODUCT($F$4:F240)-1","v":0},{"$f":"PRODUCT($G$4:G240)-1","v":0}]
["2017-06-26",null,"2017-06-26",null,null,1,1,{"$f":"PRODUCT($F$4:F241)-1","v":0},{"$f":"PRODUCT($G$4:G241)-1","v":0}]
["2017-06-27",null,"2017-06-27",null,null,1,1,{"$f":"PRODUCT($F$4:F242)-1","v":0},{"$f":"PRODUCT($G$4:G242)-1","v":0}]
["2017-06-28",null,"2017-06-28",null,null,1,1,{"$f":"PRODUCT($F$4:F243)-1","v":0},{"$f":"PRODUCT($G$4:G243)-1","v":0}]
["2017-06-29",null,"2017-06-29",null,null,1,1,{"$f":"PRODUCT($F$4:F244)-1","v":0},{"$f":"PRODUCT($G$4:G244)-1","v":0}]
["2017-06-30",null,"2017-06-30",null,null,1,1,{"$f":"PRODUCT($F$4:F245)-1","v":0},{"$f":"PRODUCT($G$4:G245)-1","v":0}]
["2017-07-03",null,"2017-07-03",null,null,1,1,{"$f":"PRODUCT($F$4:F246)-1","v":0},{"$f":"PRODUCT($G$4:G246)-1","v":0}]
["2017-07-04",null,"2017-07-04",null,null,1,1,{"$f":"PRODUCT($F$4:F247)-1","v":0},{"$f":"PRODUCT($G$4:G247)-1","v":0}]
[null,null,null,null,null,1,1,{"$f":"PRODUCT($F$4:F248)-1","v":0},{"$f":"PRODUCT($G$4:G248)-1","v":0}]
[null,null,null,null,null,1,1,{"$f":"PRODUCT($F$4:F249)-1","v":0},{"$f":"PRODUCT($G$4:G249)-1","v":0}]
[null,null,null,null,null,1,1,{"$f":"PRODUCT($F$4:F250)-1","v":0},{"$f":"PRODUCT($G$4:G250)-1","v":0}]

{"sheet":"Shareholders","index":6,"n_rows":19,"n_cols":4,"rows_kept":19,"cut":false,"hidden":false,"merged":[]}
["7203 Toyota"]
[null,"2021-03-31","2021-03-31","2021-03-31"]
["持股人名","持有股數","持有股數比率","職稱1"]
["Akio Toyota",4792000,0.15,"President"]
["Takeshi Uchiyamada",85000,0,"Chairman"]
["Sakari Sasakawa",43000,0,"Vice Chairman"]
["Koshi Kobayashi",34000,0]
["Masashu Yasuda",11000,0]
["Katsuyuki Ogura",5000,0]
["Kenta Kon",5000,0]
["Jihiko Kato",1000,0]
["Nobuyuki Hirano",1000,0]
["Teiko Kudo",1000,0]
["Hirotsukasa Osu",0,0]
["Ikuro Sugawara",0,0]
["Kuffner James",0,0]
["Nadako Waki",0,0]
["Philipcraven Sir",0,0]
["Ryuji Sakai",0,0]

{"sheet":"Finance","index":7,"n_rows":55,"n_cols":4,"rows_kept":55,"cut":false,"hidden":false,"merged":[]}
["7203 Toyota"]
["Data Field","2017-03-31","2016-12-30","2016-09-30"]
["銷貨收入及營業收入"]
["營業成本及費用"]
["營業利益"]
["營業外收入"]
["營業外費用合計"]
["經常收入"]
["經常費用"]
["經常利益"]
["特別利益"]
["特別損失"]
["稅前淨利"]
["合併淨利"]
["特別股息"]
["不屬於普通股東利益"]
["每股盈餘－加權"]
["加權平均普通股數-千"]
["員工人數及臨時員工數"]
["員工人數"]
["當期平均臨時員工人數"]
["營業利益率"]
["稅前淨利率"]
["稅後淨利率"]
["業外收支／營收"]
["收支比率"]
["每股現金流量"]
["每股稅前淨利"]
["現金流量比率"]
["營收成長率"]
["營業利益成長率"]
["稅前淨利成長率"]
["稅後淨利成長率"]
["總資產成長率"]
["淨值成長率"]
["流動資產／流動負債"]
["總負債／總淨值"]
["負債比率"]
["淨值／資產"]
["營運產生現金流量淨額"]
["投資產生現金流量淨額"]
["理財產生現金流量淨額"]
["現金及等價物淨增減額"]
["現金及等價物期初金額"]
["現金及等價物期末金額"]
["流動資產"]
["非流動資產"]
["總資產"]
["流動負債"]
["非流動負債"]
["總負債"]
["股東資本金"]
["少數股權"]
["股東權益"]
["負債及股東權益"]

{"sheet":"Finance_yearly","index":8,"n_rows":8,"n_cols":55,"rows_kept":8,"cut":false,"hidden":false,"merged":[]}
["7203 Toyota"]
["年月","銷貨收入及營業收入","營業成本及費用","營業利益","營業外收入","營業外費用合計","經常收入","經常費用","經常利益","特別利益","特別損失","稅前淨利","合併淨利","特別股息","不屬於普通股東利益","每股盈餘－加權","加權平均普通股數-千","員工人數及臨時員工數","員工人數","當期平均臨時員工人數","營業利益率","稅前淨利率","稅後淨利率","業外收支／營收","收支比率","每股現金流量","每股稅前淨利","現金流量比率","營收成長率","營業利益成長率","稅前淨利成長率","稅後淨利成長率","總資產成長率","淨值成長率","流動資產／流動負債","總負債／總淨值","負債比率","淨值／資產","營運產生現金流量淨額","投資產生現金流量淨額","理財產生現金流量淨額","現金及等價物淨增減額","現金及等價物期初金額","現金及等價物期末金額","流動資產","非流動資產","總資產","流動負債","非流動負債","總負債","股東資本金","少數股權","股東權益","負債及股東權益","季別"]
["2017-03-31"]
["2016-03-31"]
["2015-03-31"]
["2014-03-31"]
["2013-03-29"]
["2012-03-30"]

{"sheet":"YOY","index":9,"n_rows":48,"n_cols":13,"rows_kept":48,"cut":false,"hidden":false,"merged":[]}
["7203 Toyota"]
["年月","營業利益成長率","稅後淨利成長率","稅前淨利成長率","營收成長率","銷貨收入及營業收入","營業利益率","稅後淨利率","加權平均普通股數-千","稅前淨利",null,"年月","每股盈餘－加權"]
["2012-09-28",null,null,null,null,null,null,null,null,null,{"$f":"IF(ROUNDUP((MONTH(L3)/3),0)<=0,YEAR(L3)&\"Q4\",YEAR(L3)&\"Q\"&(ROUNDUP((MONTH(L3)/3),0)))","v":"2017Q1"},"2017-03-31"]
["2012-12-28",null,null,null,null,null,null,null,null,null,{"$f":"IF(ROUNDUP((MONTH(L4)/3),0)<=0,YEAR(L4)&\"Q4\",YEAR(L4)&\"Q\"&(ROUNDUP((MONTH(L4)/3),0)))","v":"2016Q4"},"2016-12-30"]
["2013-03-29",null,null,null,null,null,null,null,null,null,"2015Q4","2015-12-30"]
["2013-06-28",null,null,null,null,null,null,null,null,null,"2014Q4","2014-12-30"]
["2013-09-30",null,null,null,null,null,null,null,null,null,"2013Q4","2013-12-30"]
["2013-12-30",null,null,null,null,null,null,null,null,null,"2012Q4","2012-12-28"]
["2014-03-31",null,null,null,null,null,null,null,null,null,"1900Q1"]
["2014-06-30",null,null,null,null,null,null,null,null,null,"1900Q1"]
["2014-09-30",null,null,null,null,null,null,null,null,null,"1900Q1"]
["2014-12-30",null,null,null,null,null,null,null,null,null,"1900Q1"]
["2015-03-31",null,null,null,null,null,null,null,null,null,"1900Q1"]
["2015-06-30",null,null,null,null,null,null,null,null,null,"1900Q1"]
["2015-09-30",null,null,null,null,null,null,null,null,null,"1900Q1"]
["2015-12-30",null,null,null,null,null,null,null,null,null,"1900Q1"]
["2016-03-31",null,null,null,null,null,null,null,null,null,"1900Q1"]
["2016-06-30",null,null,null,null,null,null,null,null,null,"1900Q1"]
["2016-09-30",null,null,null,null,null,null,null,null,null,"1900Q1"]
["2016-12-30",null,null,null,null,null,null,null,null,null,"1900Q1"]
["2017-03-31",null,null,null,null,null,null,null,null,null,"1900Q1"]
[]
[]
[]
[]
[]
[]
[]
["年月","流動資產／流動負債","負債比率","淨值／資產"]
["2012-09-28"]
["2012-12-28"]
["2013-03-29"]
["2013-06-28"]
["2013-09-30"]
["2013-12-30"]
["2014-03-31"]
["2014-06-30"]
["2014-09-30"]
["2014-12-30"]
["2015-03-31"]
["2015-06-30"]
["2015-09-30"]
["2015-12-30"]
["2016-03-31"]
["2016-06-30"]
["2016-09-30"]
["2016-12-30"]
["2017-03-31"]

{"sheet":"Macroeconomic","index":10,"n_rows":526,"n_cols":16,"rows_kept":526,"cut":false,"hidden":false,"merged":[[2,5,2,7],[12,8,12,13]]}
[]
[]
[null,"JPY 日圓",null,null,null,"日　圓　市　場　匯　率",null,null,null,null,"年月","Data Field","CB37 日本出口-美元(百萬美元)","CB38 日本進口-美元(百萬美元)","CB2408 日本CPI年增率-2015=100(%)","CB1708 日本CPI 2015=100(指數)"]
[null,"日期","原幣兌美元 (美元)","原幣兌台幣 (台幣)",null,"日期 / 幣別","兌美元","兌台幣",null,null,"2017-05-31","數值",52131,53943]
[null,"2023-07-21",7.0516900000000002E-3,0.22099993000000001,null,{"$f":"B5","v":"2023-07-21"},{"$f":"IF(C5=\"\",\"\",C5)","v":7.0516900000000002E-3},{"$f":"IF(D5=\"\",\"\",D5)","v":0.22099993000000001},null,null,"2017-04-28","數值",57508,53137,0.4,100.3]
[null,"2023-07-20",7.1392900000000004E-3,0.22210323000000001,null,{"$f":"B6","v":"2023-07-20"},{"$f":"IF(C6=\"\",\"\",C6)","v":7.1392900000000004E-3},{"$f":"IF(D6=\"\",\"\",D6)","v":0.22210323000000001},null,null,"2017-03-31","數值",63971,58570,0.2,99.9]
[null,"2023-07-19",7.16127E-3,0.22278717000000001,null,"2023-07-19",7.16127E-3,0.22278717000000001,null,null,"2017-02-24","數值",56137,48963,0.2,99.8]
[null,"2023-07-18",7.2030499999999999E-3,0.22336671,null,"2023-07-18",7.2030499999999999E-3,0.22336671,null,null,"2017-01-24","數值",47251,56766,0.5,100]
[null,"2023-07-17",7.2092900000000001E-3,0.22370413,null,"2023-07-17",7.2092900000000001E-3,0.22370413]
[null,"2023-07-14",7.2124099999999998E-3,0.22322395]
[null,"2023-07-13",7.2437500000000002E-3,0.22412170000000001]
[null,"2023-07-12",7.2196999999999999E-3,0.22489350999999999]
[null,"2023-07-11",7.12504E-3,0.22308513999999999,null,null,null,null,"日　本　總　體　經　濟　資　訊　概　況"]
[null,"2023-07-10",7.0766400000000004E-3,0.22192343,null,null,null,null,"日期 / 名稱","出口總額(百萬美元)","進口總額(百萬美元)","CPI消費者物價指數","CPI年增率","實質GDP成長率"]
[null,"2023-07-07",7.0363099999999996E-3,0.22009569000000001,null,null,null,null,{"$f":"K4","v":"2017-05-31"},{"$f":"M4","v":52131},53943,{"$f":"P4","v":0},{"$f":"O4","v":0},0]
[null,"2023-07-06",6.9410699999999997E-3,0.21718609,null,null,null,null,{"$f":"K5","v":"2017-04-28"},57508,53137,{"$f":"P5","v":100.3},{"$f":"O5","v":0.4},0]
[null,"2023-07-05",6.9127600000000004E-3,0.21581639999999999,null,null,null,null,{"$f":"K6","v":"2017-03-31"},63971,58570,99.9,0.2,0]
[null,"2023-07-04",6.9218500000000002E-3,0.21513117000000001,null,null,null,null,{"$f":"K7","v":"2017-02-24"},56137,48963,99.8,0.2,0]
[null,"2023-07-03",6.91181E-3,0.21495715000000001,null,null,null,null,{"$f":"K8","v":"2017-01-24"},47251,56766,100,0.5,0]
[null,"2023-06-30",6.92905E-3,0.21590909]
[null,"2023-06-29",6.90655E-3,0.2148629]
[null,"2023-06-28",6.9208899999999999E-3,0.21454772]
[null,"2023-06-27",6.9410699999999997E-3,0.215312]
[null,"2023-06-26",6.9686399999999999E-3,0.21609755999999999]
[null,"2023-06-23",6.9574900000000002E-3,0.21568218]
[null,"2023-06-22",6.9876299999999999E-3,0.21668646]
[null,"2023-06-21",7.0482100000000001E-3,0.21807161]
[null,"2023-06-20",7.0701399999999999E-3,0.21882070000000001]
[null,"2023-06-19",7.0427500000000004E-3,0.21698711000000001]
[null,"2023-06-16",7.0487099999999997E-3,0.21604286]
[null,"2023-06-15",7.1291100000000001E-3,0.21864975]
[null,"2023-06-14",7.1382700000000004E-3,0.21950175]
[null,"2023-06-13",7.1316499999999998E-3,0.21851376]
[null,"2023-06-12",7.1633199999999999E-3,0.22034384000000001]
[null,"2023-06-09",7.1746300000000004E-3,0.22004592000000001]
[null,"2023-06-08",7.1983899999999998E-3,0.22113447]
[null,"2023-06-07",7.1346999999999999E-3,0.21946346999999999]
[null,"2023-06-06",7.16127E-3,0.21985104999999999]
[null,"2023-06-05",7.1643499999999999E-3,0.21994554999999999]
[null,"2023-06-02",7.1443899999999996E-3,0.21918983]
[null,"2023-06-01",7.2051299999999997E-3,0.22098134]
[null,"2023-05-31",7.1766900000000003E-3,0.22039615000000001]
[null,"2023-05-30",7.15308E-3,0.21874105999999999]
[null,"2023-05-29",7.1199699999999998E-3,0.21801353000000001]
[null,"2023-05-26",7.1103499999999997E-3,0.21821672]
[null,"2023-05-25",7.1398E-3,0.22019135000000001]
[null,"2023-05-24",7.1694899999999997E-3,0.22103527000000001]
[null,"2023-05-23",7.2155300000000004E-3,0.22231041000000001]
[null,"2023-05-22",7.21501E-3,0.22121212000000001]
[null,"2023-05-19",7.2516300000000002E-3,0.22197243999999999]
[null,"2023-05-18",7.2092900000000001E-3,0.22161343999999999]
[null,"2023-05-17",7.2621600000000001E-3,0.22352941000000001]
[null,"2023-05-16",7.3324499999999999E-3,0.22620619]
[null,"2023-05-15",7.34646E-3,0.22590361]
[null,"2023-05-12",7.3670300000000001E-3,0.22697804999999999]
[null,"2023-05-11",7.4316299999999998E-3,0.22867122000000001]
[null,"2023-05-10",7.4426900000000001E-3,0.22841620000000001]
[null,"2023-05-09",7.3942599999999997E-3,0.22729962000000001]
[null,"2023-05-08",7.4002800000000004E-3,0.22696662000000001]
[null,"2023-05-05",7.4151E-3,0.22682782000000001]
[null,"2023-05-04",7.4465699999999996E-3,0.22875866]
[null,"2023-05-03",7.4216999999999998E-3,0.22814308999999999]
[null,"2023-05-02",7.3233200000000004E-3,0.2253387]
[null,"2023-05-01",7.2737899999999996E-3,0.22410532]
[null,"2023-04-28",7.3362200000000001E-3,0.22544201]
[null,"2023-04-27",7.46213E-3,0.229162]
[null,"2023-04-26",7.48111E-3,0.22981971000000001]
[null,"2023-04-25",7.4783100000000002E-3,0.22980856]
[null,"2023-04-24",7.4493399999999996E-3,0.22839690000000001]
[null,"2023-04-21",7.4549000000000004E-3,0.22841807]
[null,"2023-04-20",7.4493399999999996E-3,0.22780095]
[null,"2023-04-19",7.42225E-3,0.22712091000000001]
[null,"2023-04-18",7.4560099999999999E-3,0.22748284999999999]
[null,"2023-04-17",7.4355000000000003E-3,0.22715444000000001]
[null,"2023-04-14",7.4744E-3,0.22811869000000001]
[null,"2023-04-13",7.54318E-3,0.22976541]
[null,"2023-04-12",7.5097599999999999E-3,0.22927305000000001]
[null,"2023-04-11",7.4794299999999996E-3,0.22827225000000001]
[null,"2023-04-10",7.4850300000000002E-3,0.22829341]
[null,"2023-04-07",7.5660099999999997E-3,0.23008247000000001]
[null,"2023-04-06",7.5878300000000003E-3,0.2317323]
[null,"2023-04-05",7.6149900000000003E-3,0.23279013000000001]
[null,"2023-04-04",7.5918599999999998E-3,0.23132401999999999]
[null,"2023-04-03",7.5517300000000004E-3,0.23025223]
[null,"2023-03-31",7.5323899999999999E-3,0.23003916999999999]
[null,"2023-03-30",7.5346600000000003E-3,0.22958107]
[null,"2023-03-29",7.5261499999999997E-3,0.22954768]
[null,"2023-03-28",7.6405900000000001E-3,0.23196822]
[null,"2023-03-27",7.6005200000000004E-3,0.23067568999999999]
[null,"2023-03-24",7.6505200000000001E-3,0.23211689999999999]
[null,"2023-03-23",7.6423400000000001E-3,0.23179213000000001]
[null,"2023-03-22",7.60803E-3,0.23120816]
[null,"2023-03-21",7.5477399999999998E-3,0.23013058]
[null,"2023-03-20",7.6149900000000003E-3,0.23240938]
[null,"2023-03-17",7.5855300000000001E-3,0.23234468999999999]
[null,"2023-03-16",7.4766399999999997E-3,0.22833645]
[null,"2023-03-15",7.4945699999999999E-3,0.22940868]
[null,"2023-03-14",7.4498999999999998E-3,0.22729642999999999]
[null,"2023-03-13",7.5069400000000001E-3,0.22866151000000001]
[null,"2023-03-10",7.4074099999999997E-3,0.22844444]
[null,"2023-03-09",7.3453800000000003E-3,0.22660496999999999]
[null,"2023-03-08",7.2806700000000004E-3,0.22388060000000001]
[null,"2023-03-07",7.2912899999999998E-3,0.22449872000000001]
[null,"2023-03-06",7.35727E-3,0.22550028999999999]
[null,"2023-03-03",7.36106E-3,0.22458594000000001]
[null,"2023-03-02",7.3115400000000001E-3,0.22424508000000001]
[null,"2023-03-01",7.3421399999999996E-3,0.22452275999999999]
[null,"2023-02-28",7.3410699999999999E-3,0.22559096000000001]
[null,"2023-02-27",7.3405299999999996E-3,0.22528078000000001]
[null,"2023-02-24",7.3281500000000003E-3,0.22475450999999999]
[null,"2023-02-23",7.4250100000000001E-3,0.22564598]
[null,"2023-02-22",7.4112500000000003E-3,0.22633958000000001]
[null,"2023-02-21",7.4063100000000002E-3,0.22611465]
[null,"2023-02-20",7.4482300000000001E-3,0.22635184999999999]
[null,"2023-02-17",7.4571200000000002E-3,0.22639820999999999]
[null,"2023-02-16",7.4660300000000002E-3,0.22666865999999999]
[null,"2023-02-15",7.4532299999999999E-3,0.22628008999999999]
[null,"2023-02-14",7.5120200000000003E-3,0.22738881999999999]
[null,"2023-02-13",7.5528699999999997E-3,0.22817220999999999]
[null,"2023-02-10",7.6103500000000001E-3,0.22922374000000001]
[null,"2023-02-09",7.6022499999999996E-3,0.22897977999999999]
[null,"2023-02-08",7.60861E-3,0.22879099]
[null,"2023-02-07",7.6289299999999999E-3,0.22917302000000001]
[null,"2023-02-06",7.5386400000000001E-3,0.22653599999999999]
[null,"2023-02-03",7.6231099999999998E-3,0.22854094]
[null,"2023-02-02",7.7688000000000002E-3,0.23096644]
[null,"2023-02-01",7.7549400000000001E-3,0.23101978000000001]
[null,"2023-01-31",7.6857999999999996E-3,0.23095842]
[null,"2023-01-30",7.6657699999999997E-3,0.23073974999999999]
[null,"2023-01-27",7.7011900000000001E-3,0.23180592999999999]
[null,"2023-01-26",7.67931E-3,0.23206880999999999]
[null,"2023-01-25",7.7166400000000003E-3,0.23342851000000001]
[null,"2023-01-24",7.6822599999999998E-3,0.23246523999999999]
[null,"2023-01-23",7.65287E-3,0.23195837]
[null,"2023-01-20",7.7220099999999996E-3,0.23420848999999999]
[null,"2023-01-19",7.7863400000000001E-3,0.23600404999999999]
[null,"2023-01-18",7.7567499999999998E-3,0.23549487999999999]
[null,"2023-01-17",7.8039600000000004E-3,0.23622599999999999]
[null,"2023-01-16",7.7778600000000002E-3,0.23621374000000001]
[null,"2023-01-13",7.8210499999999995E-3,0.23697794]
[null,"2023-01-12",7.7339499999999999E-3,0.23472544000000001]
[null,"2023-01-11",7.5477399999999998E-3,0.22967771000000001]
[null,"2023-01-10",7.56144E-3,0.23017013]
[null,"2023-01-09",7.5820799999999997E-3,0.23110168]
[null,"2023-01-06",7.5694500000000001E-3,0.23147377]
[null,"2023-01-05",7.4962500000000003E-3,0.23028486000000001]
[null,"2023-01-04",7.5397700000000003E-3,0.23132021]
[null,"2023-01-03",7.63301E-3,0.23456225]
[null,"2023-01-02",7.64877E-3,0.23504665999999999]
[null,"2022-12-30",7.6265999999999999E-3,0.23367906999999999]
[null,"2022-12-29",7.5170999999999997E-3,0.23047433000000001]
[null,"2022-12-28",7.4360499999999996E-3,0.22917905999999999]
[null,"2022-12-27",7.4906399999999998E-3,0.23048689]
[null,"2022-12-26",7.5255900000000004E-3,0.23126129000000001]
[null,"2022-12-23",7.5306899999999996E-3,0.23164394999999999]
[null,"2022-12-22",7.5557200000000001E-3,0.23241405000000001]
[null,"2022-12-21",7.5494500000000001E-3,0.23169259]
[null,"2022-12-20",7.5930099999999999E-3,0.23340926000000001]
[null,"2022-12-19",7.3040700000000002E-3,0.22474617999999999]
[null,"2022-12-16",7.3152900000000003E-3,0.22523774999999999]
[null,"2022-12-15",7.2584700000000004E-3,0.22341584]
[null,"2022-12-14",7.3817099999999997E-3,0.22484683]
[null,"2022-12-13",7.3751800000000003E-3,0.22590162]
[null,"2022-12-12",7.2653300000000004E-3,0.22311828]
[null,"2022-12-09",7.3222499999999998E-3,0.22486637000000001]
[null,"2022-12-08",7.3152900000000003E-3,0.22414044999999999]
[null,"2022-12-07",7.3195700000000001E-3,0.22397892]
[null,"2022-12-06",7.29607E-3,0.22340581000000001]
[null,"2022-12-05",7.3104800000000003E-3,0.22362746]
[null,"2022-12-02",7.4454600000000001E-3,0.22745886000000001]
[null,"2022-12-01",7.3888000000000001E-3,0.22609724]
[null,"2022-11-30",7.2437500000000002E-3,0.22325244]
[null,"2022-11-29",7.2092900000000001E-3,0.22305530000000001]
[null,"2022-11-28",7.1978700000000003E-3,0.22313395]
[null,"2022-11-25",7.1844200000000004E-3,0.22228608]
[null,"2022-11-24",7.2139700000000001E-3,0.22233443999999999]
[null,"2022-11-23",7.1638400000000003E-3,0.22301024]
[null,"2022-11-22",7.0811499999999996E-3,0.22029457999999999]
[null,"2022-11-21",7.0353200000000003E-3,0.21985367]
[null,"2022-11-18",7.1230099999999999E-3,0.22173944000000001]
[null,"2022-11-17",7.1326699999999998E-3,0.22196862000000001]
[null,"2022-11-16",7.1663999999999999E-3,0.22251683999999999]
[null,"2022-11-15",7.1782399999999998E-3,0.22338669]
[null,"2022-11-14",7.1489800000000001E-3,0.22090362999999999]
[null,"2022-11-11",7.2046100000000002E-3,0.22413545000000001]
[null,"2022-11-10",7.0937099999999996E-3,0.22487054000000001]
[null,"2022-11-09",6.8301300000000002E-3,0.2181545]
[null,"2022-11-08",6.8638900000000001E-3,0.21895806000000001]
[null,"2022-11-07",6.82082E-3,0.21806152000000001]
[null,"2022-11-04",6.8203500000000002E-3,0.21831946999999999]
[null,"2022-11-03",6.744E-3,0.21722416999999999]
[null,"2022-11-02",6.7599499999999998E-3,0.21827891999999999]
[null,"2022-11-01",6.7458199999999996E-3,0.21708041]
[null,"2022-10-31",6.7231399999999998E-3,0.21688853]
[null,"2022-10-28",6.7805799999999996E-3,0.21772443999999999]
[null,"2022-10-27",6.8343400000000004E-3,0.21958721]
[null,"2022-10-26",6.8310699999999999E-3,0.21907234]
[null,"2022-10-25",6.7599499999999998E-3,0.21807612000000001]
[null,"2022-10-24",6.7109600000000002E-3,0.21703241000000001]
[null,"2022-10-21",6.7714000000000003E-3,0.21729414999999999]
[null,"2022-10-20",6.6600100000000001E-3,0.21385281]
[null,"2022-10-19",6.6711100000000001E-3,0.21427618000000001]
[null,"2022-10-18",6.7010699999999999E-3,0.21470214000000001]
[null,"2022-10-17",6.7096100000000004E-3,0.21464037]
[null,"2022-10-14",6.7226899999999999E-3,0.2149916]
[null,"2022-10-13",6.7925599999999996E-3,0.21654666]
[null,"2022-10-12",6.80782E-3,0.21662469000000001]
[null,"2022-10-11",6.8558899999999999E-3,0.21836006999999999]
[null,"2022-10-10",6.8624799999999998E-3,0.21829535999999999]
[null,"2022-10-07",6.8813700000000004E-3,0.21834571999999999]
[null,"2022-10-06",6.8899E-3,0.21737633000000001]
[null,"2022-10-05",6.9113300000000003E-3,0.21825973000000001]
[null,"2022-10-04",6.9376999999999998E-3,0.21964755999999999]
[null,"2022-10-03",6.9175399999999998E-3,0.21997786]
[null,"2022-09-30",6.9098900000000001E-3,0.21987286]
[null,"2022-09-29",6.9242499999999998E-3,0.21949868]
[null,"2022-09-28",6.9386600000000001E-3,0.22002498000000001]
[null,"2022-09-27",6.9055999999999996E-3,0.21925280999999999]
[null,"2022-09-26",6.9089399999999997E-3,0.21998065]
[null,"2022-09-23",6.9764199999999997E-3,0.22191991]
[null,"2022-09-22",7.0239500000000002E-3,0.22195687]
[null,"2022-09-21",6.94059E-3,0.21835092]
[null,"2022-09-20",6.95797E-3,0.21827163999999999]
[null,"2022-09-19",6.9832399999999999E-3,0.21871508000000001]
[null,"2022-09-16",6.9964299999999997E-3,0.21891835000000001]
[null,"2022-09-15",6.9686399999999999E-3,0.21777003]
[null,"2022-09-14",6.9851899999999996E-3,0.21716959999999999]
[null,"2022-09-13",6.9175399999999998E-3,0.21561981]
[null,"2022-09-12",7.0008400000000004E-3,0.21632596000000001]
[null,"2022-09-09",7.01361E-3,0.21643989]
[null,"2022-09-08",6.9391399999999999E-3,0.21455832]
[null,"2022-09-07",6.9565199999999999E-3,0.21453912999999999]
[null,"2022-09-06",7.0032899999999997E-3,0.21591147999999999]
[null,"2022-09-05",7.1128800000000002E-3,0.21850771999999999]
[null,"2022-09-02",7.1326699999999998E-3,0.21847361000000001]
[null,"2022-09-01",7.1326699999999998E-3,0.21825963000000001]
[null,"2022-08-31",7.1968300000000004E-3,0.21878374]
[null,"2022-08-30",7.2051299999999997E-3,0.21975647000000001]
[null,"2022-08-29",7.2087699999999998E-3,0.21907439000000001]
[null,"2022-08-26",7.2690300000000001E-3,0.22025151000000001]
[null,"2022-08-25",7.32601E-3,0.22139194000000001]
[null,"2022-08-24",7.2923500000000004E-3,0.2205936]
[null,"2022-08-23",7.3126099999999998E-3,0.22091408000000001]
[null,"2022-08-22",7.2722000000000004E-3,0.21932950000000001]
[null,"2022-08-19",7.3029999999999996E-3,0.21996641]
[null,"2022-08-18",7.3588899999999999E-3,0.22054603]
[null,"2022-08-17",7.4041200000000001E-3,0.22204946]
[null,"2022-08-16",7.4498999999999998E-3,0.22342248000000001]
[null,"2022-08-15",7.5007499999999996E-3,0.22509751]
[null,"2022-08-12",7.4934399999999996E-3,0.22450355999999999]
[null,"2022-08-11",7.5182299999999999E-3,0.22562213]
[null,"2022-08-10",7.5250200000000003E-3,0.22514861999999999]
[null,"2022-08-09",7.3986399999999997E-3,0.22240308]
[null,"2022-08-08",7.4063100000000002E-3,0.22248556]
[null,"2022-08-05",7.4068600000000004E-3,0.22213168999999999]
[null,"2022-08-04",7.5221899999999998E-3,0.22551526999999999]
[null,"2022-08-03",7.4704899999999998E-3,0.22389063000000001]
[null,"2022-08-02",7.5091999999999997E-3,0.22505069]
[null,"2022-08-01",7.5982100000000002E-3,0.22900994999999999]
[null,"2022-07-29",7.5052499999999998E-3,0.22523266]
[null,"2022-07-28",7.4487900000000003E-3,0.2227933]
[null,"2022-07-27",7.3206399999999998E-3,0.21896046999999999]
[null,"2022-07-26",7.3024700000000001E-3,0.21892800000000001]
[null,"2022-07-25",7.3168900000000004E-3,0.21884832000000001]
[null,"2022-07-22",7.3475399999999996E-3,0.21903011999999999]
[null,"2022-07-21",7.2806700000000004E-3,0.21769203000000001]
[null,"2022-07-20",7.2322300000000001E-3,0.21667752000000001]
[null,"2022-07-19",7.23589E-3,0.21599131999999999]
[null,"2022-07-18",7.2390299999999996E-3,0.21644707999999999]
[null,"2022-07-15",7.2186500000000001E-3,0.21605427999999999]
[null,"2022-07-14",7.1968300000000004E-3,0.21554516000000001]
[null,"2022-07-13",7.2764300000000004E-3,0.21698318999999999]
[null,"2022-07-12",7.3061999999999997E-3,0.21838241]
[null,"2022-07-11",7.2764300000000004E-3,0.21734701000000001]
[null,"2022-07-08",7.3475399999999996E-3,0.21866274999999999]
[null,"2022-07-07",7.3534799999999999E-3,0.21876609]
[null,"2022-07-06",7.3567299999999997E-3,0.21937762]
[null,"2022-07-05",7.3605199999999997E-3,0.21949065000000001]
[null,"2022-07-04",7.3692000000000002E-3,0.21908622]
[null,"2022-07-01",7.3953600000000001E-3,0.22045555]
[null,"2022-06-30",7.3697399999999996E-3,0.21910236999999999]
[null,"2022-06-29",7.3222499999999998E-3,0.21783701]
[null,"2022-06-28",7.34484E-3,0.21828865]
[null,"2022-06-27",7.3817099999999997E-3,0.21879382999999999]
[null,"2022-06-24",7.3959000000000004E-3,0.21973227000000001]
[null,"2022-06-23",7.4095999999999997E-3,0.22036159]
[null,"2022-06-22",7.3399900000000002E-3,0.21858485]
[null,"2022-06-21",7.3195700000000001E-3,0.21768409]
[null,"2022-06-20",7.4024700000000004E-3,0.22000148]
[null,"2022-06-17",7.4095999999999997E-3,0.2202134]
[null,"2022-06-16",7.5660099999999997E-3,0.22493758]
[null,"2022-06-15",7.4721700000000002E-3,0.22140028]
[null,"2022-06-14",7.3817099999999997E-3,0.21916290999999999]
[null,"2022-06-13",7.4393699999999998E-3,0.22154441]
[null,"2022-06-10",7.4393699999999998E-3,0.22065169000000001]
[null,"2022-06-09",7.4421399999999999E-3,0.22036169]
[null,"2022-06-08",7.4482300000000001E-3,0.21979741]
[null,"2022-06-07",7.5414799999999997E-3,0.22254901999999999]
[null,"2022-06-06",7.5820799999999997E-3,0.22314049999999999]
[null,"2022-06-03",7.6435100000000001E-3,0.22456623000000001]
[null,"2022-06-02",7.6994100000000003E-3,0.22489991000000001]
[null,"2022-06-01",7.6834399999999997E-3,0.22458701]
[null,"2022-05-31",7.7712199999999997E-3,0.22567609999999999]
[null,"2022-05-27",7.8671999999999995E-3,0.23050900999999999]
[null,"2022-05-26",7.8684400000000009E-3,0.23148949999999999]
[null,"2022-05-25",7.8573099999999993E-3,0.23202639999999999]
[null,"2022-05-24",7.8845700000000005E-3,0.23330442000000001]
[null,"2022-05-23",7.8186100000000001E-3,0.23127443]
[null,"2022-05-20",7.8198299999999998E-3,0.23248358]
[null,"2022-05-19",7.8235000000000006E-3,0.23235800000000001]
[null,"2022-05-18",7.7984899999999999E-3,0.23255089000000001]
[null,"2022-05-17",7.7303600000000004E-3,0.22835498000000001]
[null,"2022-05-16",7.7435300000000002E-3,0.23060244999999999]
[null,"2022-05-13",7.73874E-3,0.23061445999999999]
[null,"2022-05-12",7.7930200000000003E-3,0.23285536000000001]
[null,"2022-05-11",7.6934899999999999E-3,0.2289583]
[null,"2022-05-10",7.6657699999999997E-3,0.22782674999999999]
[null,"2022-05-09",7.6746000000000002E-3,0.22870298999999999]
[null,"2022-05-06",7.6604899999999998E-3,0.22736326000000001]
[null,"2022-05-05",7.6828499999999997E-3,0.22795022000000001]
[null,"2022-05-04",7.7465299999999997E-3,0.22736076]
[null,"2022-05-03",7.6840299999999997E-3,0.22667896000000001]
[null,"2022-05-02",7.6816699999999998E-3,0.22691658000000001]
[null,"2022-04-29",7.7011900000000001E-3,0.22680015000000001]
[null,"2022-04-28",7.6440900000000001E-3,0.22573001000000001]
[null,"2022-04-27",7.7869499999999999E-3,0.22916991]
[null,"2022-04-26",7.8604E-3,0.23101714000000001]
[null,"2022-04-25",7.8039600000000004E-3,0.22842203999999999]
[null,"2022-04-22",7.7790699999999999E-3,0.22800466999999999]
[null,"2022-04-21",7.7887700000000004E-3,0.22813302999999999]
[null,"2022-04-20",7.81922E-3,0.22863397999999999]
[null,"2022-04-19",7.7585500000000003E-3,0.22740320999999999]
[null,"2022-04-18",7.8746400000000005E-3,0.23041184000000001]
[null,"2022-04-15",7.9082600000000003E-3,0.23036772999999999]
[null,"2022-04-14",7.9440699999999993E-3,0.23085478000000001]
[null,"2022-04-13",7.9579799999999999E-3,0.23086105000000001]
[null,"2022-04-12",7.9751200000000005E-3,0.23231518000000001]
[null,"2022-04-11",7.9751200000000005E-3,0.23183666999999999]
[null,"2022-04-08",8.0450499999999998E-3,0.23258245999999999]
[null,"2022-04-07",8.0664699999999992E-3,0.23271759]
[null,"2022-04-06",8.0782000000000007E-3,0.23232894000000001]
[null,"2022-04-05",8.0906099999999998E-3,0.23220065000000001]
[null,"2022-04-04",8.1439900000000003E-3,0.23324375]
[null,"2022-04-01",8.16127E-3,0.23406513000000001]
[null,"2022-03-31",8.2169300000000008E-3,0.23533278999999999]
[null,"2022-03-30",8.2081600000000008E-3,0.23458918000000001]
[null,"2022-03-29",8.1373599999999997E-3,0.23354219000000001]
[null,"2022-03-28",8.0703700000000003E-3,0.23250746999999999]
[null,"2022-03-25",8.1933600000000002E-3,0.23498566000000001]
[null,"2022-03-24",8.1719400000000008E-3,0.23437116999999999]
[null,"2022-03-23",8.2542299999999996E-3,0.23615353]
[null,"2022-03-22",8.2781499999999997E-3,0.23634105999999999]
[null,"2022-03-21",8.3695999999999996E-3,0.23861734000000001]
[null,"2022-03-18",8.3927800000000007E-3,0.23810323]
[null,"2022-03-17",8.4317000000000003E-3,0.23802698]
[null,"2022-03-16",8.4210499999999994E-3,0.23991578999999999]
[null,"2022-03-15",8.4530899999999999E-3,0.24150464999999999]
[null,"2022-03-14",8.4609500000000001E-3,0.2415602]
[null,"2022-03-11",8.5229699999999995E-3,0.24213756]
[null,"2022-03-10",8.6110400000000004E-3,0.24412296999999999]
[null,"2022-03-09",8.6318499999999999E-3,0.24436772000000001]
[null,"2022-03-08",8.6460300000000007E-3,0.24494207000000001]
[null,"2022-03-07",8.6707699999999995E-3,0.24538281000000001]
[null,"2022-03-04",8.7085300000000008E-3,0.24505790999999999]
[null,"2022-03-03",8.6602599999999995E-3,0.24318005000000001]
[null,"2022-03-02",8.6565099999999992E-3,0.24264197000000001]
[null,"2022-03-01",8.7017099999999997E-3,0.24434389000000001]
[null,"2022-02-28",8.6979199999999996E-3,0.24362876999999999]
[null,"2022-02-25",8.65726E-3,0.24223011]
[null,"2022-02-24",8.6550099999999994E-3,0.24294616999999999]
[null,"2022-02-23",8.6941399999999995E-3,0.24256651000000001]
[null,"2022-02-22",8.6903599999999994E-3,0.24228730000000001]
[null,"2022-02-21",8.7153600000000001E-3,0.24272268]
[null,"2022-02-18",8.6933800000000006E-3,0.24219768999999999]
[null,"2022-02-17",8.7009500000000007E-3,0.24249543000000001]
[null,"2022-02-16",8.6610100000000002E-3,0.24112247000000001]
[null,"2022-02-15",8.6512700000000008E-3,0.24102430999999999]
[null,"2022-02-14",8.6550099999999994E-3,0.24130171]
[null,"2022-02-11",8.6617599999999993E-3,0.24174967999999999]
[null,"2022-02-10",8.6199499999999995E-3,0.24015170999999999]
[null,"2022-02-09",8.6550099999999994E-3,0.24060930999999999]
[null,"2022-02-08",8.6550099999999994E-3,0.24078241]
[null,"2022-02-07",8.6888499999999997E-3,0.24198453]
[null,"2022-02-04",8.6805600000000004E-3,0.24140624999999999]
[null,"2022-02-03",8.6964099999999999E-3,0.24167319000000001]
[null,"2022-02-02",8.7359099999999995E-3,0.24285839000000001]
[null,"2022-02-01",8.7191600000000001E-3,0.24239253999999999]
[null,"2022-01-31",8.6843200000000006E-3,0.24133739000000001]
[null,"2022-01-28",8.6782999999999999E-3,0.24160375000000001]
[null,"2022-01-27",8.66776E-3,0.24113720999999999]
[null,"2022-01-26",8.7199200000000008E-3,0.24206488000000001]
[null,"2022-01-25",8.7788599999999994E-3,0.24335001000000001]
[null,"2022-01-24",8.7734700000000002E-3,0.24293735999999999]
[null,"2022-01-21",8.7966199999999998E-3,0.24375440000000001]
[null,"2022-01-20",8.7657800000000008E-3,0.24228611999999999]
[null,"2022-01-19",8.7466100000000001E-3,0.24175632]
[null,"2022-01-18",8.7275300000000007E-3,0.24079246000000001]
[null,"2022-01-17",8.7244799999999997E-3,0.24009770999999999]
[null,"2022-01-14",8.75657E-3,0.24115586999999999]
[null,"2022-01-13",8.7588700000000002E-3,0.24209512]
[null,"2022-01-12",8.7229600000000001E-3,0.24127704]
[null,"2022-01-11",8.67303E-3,0.24006938]
[null,"2022-01-10",8.6805600000000004E-3,0.24019097]
[null,"2022-01-07",8.6557600000000002E-3,0.23907210000000001]
[null,"2022-01-06",8.6326000000000007E-3,0.23877762]
[null,"2022-01-05",8.6125200000000002E-3,0.23779175]
[null,"2022-01-04",8.6110400000000004E-3,0.23714801999999999]
[null,"2022-01-03",8.6715200000000003E-3,0.23968089000000001]
[null,"2021-12-31",8.6881000000000007E-3,0.24083405999999999]
[null,"2021-12-30",8.6911200000000001E-3,0.24109159999999999]
[null,"2021-12-29",8.6979199999999996E-3,0.24049751999999999]
[null,"2021-12-28",8.7092799999999998E-3,0.24081171000000001]
[null,"2021-12-27",8.7039800000000001E-3,0.2409261]
[null,"2021-12-24",8.7420199999999997E-3,0.24206660999999999]
[null,"2021-12-23",8.7404900000000001E-3,0.24219911]
[null,"2021-12-22",8.7627099999999999E-3,0.24342796999999999]
[null,"2021-12-21",8.7657800000000008E-3,0.24368864000000001]
[null,"2021-12-20",8.8004899999999994E-3,0.24526974000000001]
[null,"2021-12-17",8.7942999999999997E-3,0.24483335000000001]
[null,"2021-12-16",8.7950700000000003E-3,0.24467897999999999]
[null,"2021-12-15",8.7688499999999999E-3,0.24377410999999999]
[null,"2021-12-14",8.7904400000000001E-3,0.24472574]
[null,"2021-12-13",8.8051399999999995E-3,0.24495906000000001]
[null,"2021-12-10",8.8199000000000003E-3,0.24387017]
[null,"2021-12-09",8.8136800000000008E-3,0.24449145]
[null,"2021-12-08",8.7950700000000003E-3,0.24379946999999999]
[null,"2021-12-07",8.8051399999999995E-3,0.2443427]
[null,"2021-12-06",8.8113500000000008E-3,0.24433870999999999]
[null,"2021-12-03",8.8644599999999994E-3,0.24527967000000001]
[null,"2021-12-02",8.8354799999999997E-3,0.24536137]
[null,"2021-12-01",8.8668199999999992E-3,0.24569959]
[null,"2021-11-30",8.8370400000000009E-3,0.24425591999999999]
[null,"2021-11-29",8.8082400000000002E-3,0.24460494999999999]
[null,"2021-11-26",8.8206799999999991E-3,0.24583223000000001]
[null,"2021-11-25",8.66776E-3,0.24105053000000001]
[null,"2021-11-24",8.6640099999999998E-3,0.24094610999999999]
[null,"2021-11-23",8.6865899999999992E-3,0.24148713999999999]
[null,"2021-11-22",8.7047400000000007E-3,0.24207869000000001]
[null,"2021-11-19",8.7696200000000005E-3,0.24379549]
[null,"2021-11-18",8.7519699999999995E-3,0.24365481999999999]
[null,"2021-11-17",8.7634700000000006E-3,0.24344930000000001]
[null,"2021-11-16",8.7085300000000008E-3,0.24244535]
[null,"2021-11-15",8.7611700000000004E-3,0.24347293]
[null,"2021-11-12",8.7788599999999994E-3,0.24405231999999999]
[null,"2021-11-11",8.7665499999999997E-3,0.243973]
[null,"2021-11-10",8.7811699999999996E-3,0.24411661000000001]
[null,"2021-11-09",8.8589700000000007E-3,0.24610206000000001]
[null,"2021-11-08",8.8315800000000003E-3,0.24587123999999999]
[null,"2021-11-05",8.8183399999999992E-3,0.24559083000000001]
[null,"2021-11-04",8.7904400000000001E-3,0.24516526]
[null,"2021-11-03",8.7711600000000001E-3,0.24383826]
[null,"2021-11-02",8.7757800000000004E-3,0.24475647]
[null,"2021-11-01",8.7719300000000007E-3,0.24429824999999999]
[null,"2021-10-29",8.7703899999999994E-3,0.24407999]
[null,"2021-10-28",8.8043700000000006E-3,0.24467336000000001]
[null,"2021-10-27",8.7865700000000005E-3,0.24435462999999999]
[null,"2021-10-26",8.7596400000000008E-3,0.24351787]
[null,"2021-10-25",8.7942999999999997E-3,0.24518512000000001]
[null,"2021-10-22",8.8105700000000002E-3,0.24528633999999999]
[null,"2021-10-21",8.7719300000000007E-3,0.24447368]
[null,"2021-10-20",8.7473800000000008E-3,0.24378936000000001]
[null,"2021-10-19",8.7443199999999999E-3,0.24361664999999999]
[null,"2021-10-18",8.7473800000000008E-3,0.24492652000000001]
[null,"2021-10-15",8.7519699999999995E-3,0.24479258000000001]
[null,"2021-10-14",8.7966199999999998E-3,0.24665728000000001]
[null,"2021-10-13",8.8292400000000004E-3,0.24774853999999999]
[null,"2021-10-12",8.8020400000000006E-3,0.24768946]
[null,"2021-10-11",8.8237899999999998E-3,0.24750728]
[null,"2021-10-08",8.9102699999999996E-3,0.25020048]
[null,"2021-10-07",8.9573599999999993E-3,0.25071659000000002]
[null,"2021-10-06",8.97505E-3,0.25112188000000002]
[null,"2021-10-05",8.9710199999999997E-3,0.25038126999999999]
[null,"2021-10-04",9.0155099999999991E-3,0.25189326000000001]
[null,"2021-10-01",9.0033300000000004E-3,0.25002250999999998]
[null,"2021-09-30",8.9863400000000006E-3,0.25]
[null,"2021-09-29",8.9309599999999999E-3,0.24872733999999999]
[null,"2021-09-28",8.9686100000000001E-3,0.24923766999999999]
[null,"2021-09-27",9.0081999999999992E-3,0.24970723]
[null,"2021-09-24",9.0301600000000006E-3,0.25049665999999998]
[null,"2021-09-23",9.0637200000000008E-3,0.25160881000000002]
[null,"2021-09-22",9.1066399999999992E-3,0.25280028999999998]
[null,"2021-09-21",9.1558300000000002E-3,0.2541659]
[null,"2021-09-20",9.1399299999999992E-3,0.25418151999999999]
[null,"2021-09-17",9.0917399999999992E-3,0.25275025000000001]
[null,"2021-09-16",9.1124499999999994E-3,0.25296154999999998]
[null,"2021-09-15",9.1432800000000002E-3,0.25299442]
[null,"2021-09-14",9.1166000000000007E-3,0.25252985999999999]
[null,"2021-09-13",9.0900800000000004E-3,0.25170439]
[null,"2021-09-10",9.0983499999999998E-3,0.25175143]
[null,"2021-09-09",9.1124499999999994E-3,0.25214143]
[null,"2021-09-08",9.0686499999999993E-3,0.25138296999999998]
[null,"2021-09-07",9.0678300000000007E-3,0.25054407000000001]
[null,"2021-09-06",9.1041500000000001E-3,0.25081936999999999]
[null,"2021-09-03",9.1157700000000005E-3,0.25177758]
[null,"2021-09-02",9.0966999999999992E-3,0.25170563000000001]
[null,"2021-09-01",9.0875999999999995E-3,0.25199927]
[null,"2021-08-31",9.0909100000000007E-3,0.25145455]
[null,"2021-08-30",9.0975299999999995E-3,0.25263827999999999]
[null,"2021-08-27",9.1033199999999998E-3,0.25389167000000001]
[null,"2021-08-26",9.0834799999999997E-3,0.25379235]
[null,"2021-08-25",9.0909100000000007E-3,0.25381818]
[null,"2021-08-24",9.1174299999999993E-3,0.25455872000000002]
[null,"2021-08-23",9.1166000000000007E-3,0.25471783999999997]
[null,"2021-08-20",9.1082999999999997E-3,0.25485016999999999]
[null,"2021-08-19",9.1099600000000003E-3,0.25544319999999998]
[null,"2021-08-18",9.1099600000000003E-3,0.25389451000000002]
[null,"2021-08-17",9.1249199999999999E-3,0.25485901999999999]
[null,"2021-08-16",9.1516400000000008E-3,0.25478172999999998]
[null,"2021-08-13",9.1232599999999994E-3,0.25380895999999997]
[null,"2021-08-12",9.0546900000000007E-3,0.25190148000000001]
[null,"2021-08-11",9.0546900000000007E-3,0.25190148000000001]
[null,"2021-08-10",9.0432299999999993E-3,0.25194429000000002]
[null,"2021-08-09",9.0645399999999994E-3,0.25226612999999998]
[null,"2021-08-06",9.0719400000000006E-3,0.25238137999999999]
[null,"2021-08-05",9.1099600000000003E-3,0.25298351000000002]
[null,"2021-08-04",9.1340899999999992E-3,0.25383632]
[null,"2021-08-03",9.1717900000000008E-3,0.25589286999999999]
[null,"2021-08-02",9.1482899999999999E-3,0.25560333000000002]
[null,"2021-07-30",9.1166000000000007E-3,0.25471783999999997]
[null,"2021-07-29",9.1332500000000007E-3,0.25490911999999999]
[null,"2021-07-28",9.0983499999999998E-3,0.25429897000000001]
[null,"2021-07-27",9.1082999999999997E-3,0.25539666999999999]
[null,"2021-07-26",9.0587900000000006E-3,0.25418969000000002]
[null,"2021-07-23",9.0456800000000004E-3,0.25373134000000003]
[null,"2021-07-22",9.0785299999999996E-3,0.25447118000000002]
[null,"2021-07-21",9.0670100000000003E-3,0.25396680999999999]